{"text_format":"1","workbook":"xlsx","n_sheets":12,"sheets":["CurTiPot","    pH   ","+pH","Titulador","Simulador","Distribuição","Analise_I","+I","Analise_II","+II","Graficos","Constantes"],"not_rendered":{"charts":21,"images":6,"macros":1,"external_links":0,"defined_names":28,"comments":11,"pivot_tables":0},"unopened":[],"bounds":{"document_bytes":16777216,"sheet_cells":100000,"rows_first":2000,"rows_last":500,"rows_between":2000,"halvings":0,"cell_chars":16384,"cell_head_chars":4096},"cells_cut":0,"cells_raw":0,"read":"whole","date_system":"1900"}

{"sheet":"CurTiPot","index":0,"n_rows":49,"n_cols":39,"rows_kept":49,"cut":false,"hidden":false,"merged":[]}
[null,null,null,null,null,null,null,null,null,null,null,null,null,null,null,null,null," Sumário dos recursos e usos (veja histórico das versões do CurTiPot no final):"]
[null,null,null,null,null,null,null,null,null,null,null,null,null,null,null,null,null,"•  Cálculo de pH, atividade e capacidade de tamponamento de soluções aquosas simples ou complexas (até sete sistemas hexapróticos)"]
[null,null,null,null,null,null,null,null,null,null,null,null,null,null,null,null,null,"•  Análise de dados de pH em função de volume de titulante - reais ou simulados"]
[null,null,null,null,null,null,null,null,null,null,null,null,null,null,null,null,null,"    »  representação gráfica das curvas de titulação, com derivadas"]
[null,null,null,null,null,null,null,null,null,null,null,null,null,null,null,null,null,"    »  localização automática e precisa das inflexões das curvas (por interpolação com alisamento por splines) para determinação de concentrações"]
[null,null,null,null,null,null,null,null,null,null,null,null,null,null,null,null,null,"    »  determinação de concentrações e pKas (inclusive de amostras diluídas com múltiplos componentes) por regressão não linear"]
[null,null,null,null,null,null,null,null,null,null,null,null,null,null,null,null,null,"•  Titulação virtual de ácidos e bases com adição de titulante por bureta e detecção de ponto final por indicador visual"]
[null,null,null,null,null,null,null,null,null,null,null,null,null,null,null,null,null,"•  Simulação de curvas de titulação de ácidos, bases e misturas complexas de sistemas multipróticos"]
[null,null,null,null,null,null,null,null,null,null,null,null,null,null,null,null,null,"    »  simulação de dispersão nas medidas de pH e de volume, para avaliar o efeito dos erros nos resultados"]
[null,null,null,null,null,null,null,null,null,null,null,null,null,null,null,null,null,"•  Geração de diagramas de distribuição (composição fracionária), capacidade de tamponamento e  protonação em função do pH e do Volume"]
[null,null,null,null,null,null,null,null,null,null,null,null,null,null,null,null,null,"•  Constantes de equilíbrio (pKas) de 250 ácidos e bases disponíveis diretamente nos diversos módulos"]
[null,null,null,null,null,null,null,null,null,null,null,null,null,null,null,null,null,null,null,null,null,null,null,null,null,null,null,null,null,null,null,null,null,null,null,null,null,null,"Como habilitar arquivos Excel com macros e usar o CurTiPot"]
[null,null,null,null,null,null,null,null,null,null,null,null,null,null,null,null,null,"CurTiPot não requer instalação. Basta que o programa Microsoft Excel® (2007 ou posterior) se encontre instalado em ambiente Windows® ou Windows for Mac (certas versões)",null,null,null,null,null,null,null,null,null,null,null,null,null,null,null,null,null,null,null,null,"Excel e Office para  Windows"]
[null,null,null,null,null,null,null,null,null,null,null,null,null,null,null,null,null,"Obtenha cópia atualizada do CurTiPot em www.iq.usp.br/gutz/Curtipot.html e abra o arquivo curtipot.xlsm ou curtipot-i.xlsm (para iniciantes) ",null,null,null,null,null,null,null,null,null,null,null,null,null,null,null,null,null,null,null,null,"1. Baixe o arquivo CurTiPot do site do autor para um folder da sua preferência"]
[null,null,null,null,null,null,null,null,null,null,null,null,null,null,null,null,null,"Leia a licença no final desta página (células B48 a P95) e, se estiver de acordo, utilize o programa gratuitamente no ensino e em aplicações não comerciais",null,null,null,null,null,null,null,null,null,null,null,null,null,null,null,null,null,null,null,null,"2. Abra o folder e clique com o botão direito no arquivo curtipot.xlsm"]
[null,null,null,null,null,null,null,null,null,null,null,null,null,null,null,null,null,"Habilite a edição e o conteúdo, permitindo a execução de macros pelo Excel®; siga as instruções  à direita   ------>           ------>           ------>           ------>           ------>           ------>            ------>   ",null,null,null,null,null,null,null,null,null,null,null,null,null,null,null,null,null,null,null,null,"3. Escolha \"Propriedades\" na janela que se abrir"]
[null,null,null,null,null,null,null,null,null,null,null,null,null,null,null,null,null,"Para usar o módulo Analise_II ative ou instale o suplemento Solver do Excel (pré-instalado ou disponível no disco do Office®) ",null,null,null,null,null,null,null,null,null,null,null,null,null,null,null,null,null,null,null,null,"4. Assinale \"desbloquear\" (em geral, próximo ao canto inferior direito)"]
[null,null,null,null,null,null,null,null,null,null,null,null,null,null,null,null,null,null,null,null,null,null,null,null,null,null,null,null,null,null,null,null,null,null,null,null,null,null,"5. Clique OK"]
[null,null,null,null,null,null,null,null,null,null,null,null,null,null,null,null,null,"O autor não garante o funcionamento correto e exato do programa e se isenta de qualquer responsabilidade pelos resultados e consequências do uso (mais detalhes na licença de uso)",null,null,null,null,null,null,null,null,null,null,null,null,null,null,null,null,null,null,null,null,"6. Dê um clique duplo no arquivo curtipot.xlsm para abrí-lo"]
[null,null,null,null,null,null,null,null,null,null,null,null,null,null,null,null,null,"CurTiPot considera somente os equilíbrios de protonação em água, ignorando outros equilíbrios e reações, p.ex., entre dois ou mais sistemas ácido-base, quando presentes simultaneamente",null,null,null,null,null,null,null,null,null,null,null,null,null,null,null,null,null,null,null,null,"7. Escolha \"Habilitar conteúdo\", se a pregunta aparecer na barra de segurança "]
[null,null,null,null,null,null,null,null,null,null,null,null,null,null,null,null,null,"O programa calcula coeficientes de atividade pela equação de Davies nos módulos pH, Distribuição, Simulação e Analise_II, estando sujeito às suas limitações",null,null,null,null,null,null,null,null,null,null,null,null,null,null,null,null,null,null,null,null,"8. Leia a página de rosto do CurTiPot "]
[null,null,null,null,null,null,null,null,null,null,null,null,null,null,null,null,null,"Favor comunicar erros e incompatibilidades do programa (testado em versões de 2003 a 2013 do Excel);",null,null,null,null,null,null,null,null,null,null,"Use o e-mail:","gutz@iq.usp.br",null,null,null,null,null,null,null,null,"9. Use o programa, seguindo as instruções"]
[null,null,null,null,null,null,null,null,null,null,null,null,null,null,null,null,null,"Dependendo da resolução da tela do monitor usado, pode ser necessário redimensionar ou reposicionar algumas figuras",null,null,null,null,null,null,null,null,null,null,null,null,null,null,null,null,null,null,null,null,"10. Salve seus dados, ajustes e resultados em arquivo Curtipot_qualquer_nome.xlsm"]
[null,null,null,null,null,null,null,null,null,null,null,null,null,null,null,null,null,null,null,null,null,null,null,null,null,null,null,null,null,null,null,null,null,null,null,null,null,null,"11. Feche o arquivo, momento em que também todas as macros serão removidas"]
[null,null,null,null,null,null,null,null,null,null,null,null,null,null,null,null,null,"Alterne entre os módulos com Ctrl+PgDn ou, no rodapé desta planilha, clique na aba do módulo escolhido, p.ex., Titulador, para efetuar titulações virtuais usando bureta e indicador visual"]
[null,null,null,null,null,null,null,null,null,null,null,null,null,null,null,null,null,"Leia as informações e siga as instruções que aparecem ao se posicionar o mouse sobre células com marca vermelha no canto superior direito; se for iniciante, prefira CurTiPot-i",null,null,null,null,null,null,null,null,null,null,null,null,null,null,null,null,null,null,null,null,"Versões anteriores do Office e do Excel"]
[null,null,null,null,null,null,null,null,null,null,null,null,null,null,null,null,null,"Para simular automaticamente curvas de titulação, use o módulo Simulador; para calcular o pH de uma solução, entre no módulo pH",null,null,null,null,null,null,null,null,null,null,null,null,null,null,null,null,null,null,null,null,"1. Abra o Excel com uma planilha em branco"]
[null,null,null,null,null,null,null,null,null,null,null,null,null,null,null,null,null,"Vá direto para a Analise_I para analisar os seus dados experimentais ou simulados ",null,null,null,null,null,null,null,null,null,null,null,null,null,null,null,null,null,null,null,null,"2. Clique em Arquivo (canto superior esquerdo da tela)"]
[null,null,null,null,null,null,null,null,null,null,null,null,null,null,null,null,null,"O módulo Analise_II é mais poderoso e seu uso requer aprendizado; guie-se pelas instruções locais e pelos Exemplos",null,null,null,null,null,null,null,null,null,null,null,null,null,null,null,null,null,null,null,null,"3. Clique em \"opções do Excel\" (canto inferior direito)"]
[null,null,null,null,null,null,null,null,null,null,null,null,null,null,null,null,null,"Grave seus dados e resultados em arquivos curtipot_qualquer-nome.xlsm de modo a manter inalterado o programa curtipot-i.xlsm original",null,null,null,null,null,null,null,null,null,null,null,null,null,null,null,null,null,null,null,null,"4. Clique em \"Central de Confiabilidade\""]
[" "," "," "," "," "," "," "," "," "," "," "," "," "," "," "," ",null,null,null,null,null,null,null,null,null,null,null,null,null,null,null,null,null,null,null,null,null,null,"5. Clique em \"Configurações da Central de Confiabilidade\""]
[" "," "," "," "," "," "," "," "," "," "," ",null,null,null,null,null,null,"Veja breve histórico e conheça a origem do nome CurTiPot no final desta página (células S51 a AE97)",null,null,null,null,null,null,null,null,null,null,null,null,null,null,null,null,null,null,null,null,"6. Clique em \"Configurações de macro\""]
[" ",null,null,"Ivano Gebhardt Rolf Gutz",null,null,null,null,null,null,null,null,null,null,null,null,null,"A versão 1 do programa CurTiPot foi desenvolvida em 1991/1992 em Turbo Basic (Boreland) para DOS (Disk Operating System, Microsoft) e lançada em 1992",null,null,null,null,null,null,null,null,null,null,null,null,null,null,null,null,null,null,null,null,"7. Assinale \"desabilitar todas as macros com notificação\""]
[" "," ",null,"Professor Titular do Instituto de Química desde 1992",null,null,null,null,null,null,null,null,null,null,null,null,null,"A versão 2 (para DOS), datada de 1993 e distribuída pela AllChemy (http://allchemy.iq.usp.br) comporta análise de titulações com geração coulométrica de reagentes",null,null,null,null,null,null,null,null,null,null,null,null,null,null,null,null,null,null,null,null,"8. Clique OK e OK; (não é preciso reconfigurar a cada dia)"]
[" "," ",null,"Docente do Instituto de Química desde 1978",null,null,null,null,null,null,null,null,null,null,null,null,null,"A versão 3 para Excel, com o novo módulo de análise de dados por regressão não linear multiparamétrica, começou a ser escrita em 2005 e foi lançada em 2006",null,null,null,null,null,null,null,null,null,null,null,null,null,null,null,null,null,null,null,null,"9. Feche e reabra o Excel; carregue curtipot.xlsm"]
[" "," ",null,"Universidade de São Paulo, São Paulo, SP, Brasil",null,null,null,null,null,null,null,null,null,null,null,null,null,"A versão 3.1 foi  a 1ª a ser traduzida para o inglês e distribuída a partir de 01/05/2006 no site www.iq.usp.br/gutz/Curtipot_.html",null,null,null,null,null,null,null,null,null,null,null,null,null,null,null,null,null,null,null,null,"10. Clique \"Habilitar este Conteúdo\"  no"]
[" "," ",null,"Comendador da Ordem Nacional do Mérito Científico",null,null,null,null,null,null,null,null,null,null,null,null,null,"A versão 3.2, lançada em janeiro de 2007, inclui uma planilha específica para cálculos de pH, com estimativas das atividades dos íons"]
[" "," ",null,"Membro da Academia Brasileira de Ciências",null,null,null,null,null,null,null,null,null,null,null,null,null,"A versão 3.3, lançada em janeiro de 2008, tem interface mais amigável com a base de dados de pKa e gera diagrama logarítmico de distribuição sobreposto às titulações  "]
[null,null,null,"Membro da Academia de Ciências do Estado de São Paulo",null,null,null,null,null,null,null,null,null,null,null,null,null,"A versão 3.4, lançada em outubro de 2008, contempla cálculos de força iônica e estimativas de coeficiente de atividade no módulo de Analise_II  (anteriormente disponíveis só no módulo pH)"]
[null,"Formação, carreira, linhas de pesquisa, publicações e outras informações: ",null,null,null,null,null,null,null,null,null,null,null,null,null,null,null,"A versão 3.5, janeiro/2010, explicita a capacidade de tamponamento, CT, das soluções (módulo pH), traça curvas de CT e de carga média e detecta pontos isoelétricos (módulo Distribuição)"]
[null,"https://www.iq.usp.br/gutz/",null,null,null,"https://scholar.google.com.br/citations?user=qXFK1_YAAAAJ&hl=pt-BR",null,null,null,null,null,null,null,null,null,null,null,"A versão 3.6, março/2012, localiza automaticamente as inflexões (pontos finais) de curvas de titulação reais ou simuladas, listando os volumes respectivos no módulo Analise_I"]
[null,"Cópia atualizada de CurTiPot: https://www.iq.usp.br/docente/gutz/Curtipot.html",null,null,null,null,null,null,null,null,null,null,null,null,null,null,null,"A versão 4.0, janeiro/2014, recebeu o módulo Titulador, para iniciantes praticarem com indicador visual; no Simulador os cálculos de pH foram refinados levando em conta as atividades iônicas"]
[null,null,null,null,null,null,null,null,null,null,null,null,null,null,null,null,null,"Na versão 4.1, fevereiro/2014, o módulo Titulador passa a importar as cores dos indicadores da módulo Constantes; Distribuição e Analise_I e II passam a importar dados do Titulador"]
[null,"CurTiPot encontrou uso em mais de cem países, figura em vários livros didáticos foi e usado por centenas de autores",null,null,null,null,null,null,null,null,null,null,null,null,null,null,null,"A versão 4.2, fevereiro/2015, traz a correção do efeito da força iônica também para o módulo Distribuição e amplia as opções de ponderação de dados em Análise II"]
[null,"em pesquisas publicadas e teses listadas em: http://scholar.google.com.br/scholar?hl=pt-BR&as_sdt=0,5&q=curtipot",null,null,null,null,null,null,null,null,null,null,null,null,null,null,null,"A versão 4.2.2, setembro/2015, passa a sublinhar com linha verde as células com a concentração de bases protonadas até a neutralidade"]
[null,"Saiu-se melhor numa comparação de 21 aplicativos para cálculo de pH: https://doi.org/10.1021/acs.jchemed.2c01203",null,null,null,null,null,null,null,null,null,null,null,null,null,null,null,"A versão 4.2.3, março/2016, volta a carregar cores de indicadores no Titulador (funcionalidade ausente na 4.2.2.)"]
[null,"A Agência Fapesp publicou reportagem sobre o software: https://agencia.fapesp.br/mais-de-16-mil-downloads/7123",null,null,null,null,null,null,null,null,null,null,null,null,null,null,null,"Na versão 4.3.0, janeiro/2018, o módulo Simulador permite carregar dados reais introduzidos em Analise_I e fazer ajuste manual da curva simulada à real (por quem não domine a Analise_II)"]
[null,null,null,null,null,null,null,null,null,null,null,null,null,null,null,null,null,"A versão 4.3.1, maio/2021, permite salvar os resultados nas novas abas +pH, +I e +II e copiar dados de Análise_II para o Simulador e também traz instruções melhoradas"]
[null,null,null,null,null,null,null,null,null,null,null,null,null,null,null,null,null,"Na versão 4.4.0, janeiro/2024, introduziu-se o processamento em lote para cálculo de pH e outros parâmetros de (longas) listas de soluções com diferente composição "]

{"sheet":"    pH   ","index":1,"n_rows":161,"n_cols":33,"rows_kept":161,"cut":false,"hidden":false,"merged":[]}
[null,"      Calculadora de pH com processamento em lote",null,null,null,null,null,"↑ Passe o mouse ↑ nas marcas vermelhas            .",null,null,"  pKa dos ácidos e bases em solução",null,null,"Clique em K2 a Q2; selecione ácidos/bases; clique em J2; leia M1",null,null,null,"Constantes cumulativas de protonação = bp = PKp (não preencher - calculado pelo programa)",null,null,null,null,null,null,null,"       pKas dos HiB, carregados da planilha Constantes"]
["     Composição da solução aquosa - reagentes adicionados, mol/L",null,null,null,null," Preencha um ou mais campos; Enter; clique em B20.",null,null,null,null,6,1,4,2,8,7,5,"             pKa(n) = -log Kd(HB-->B) = log Kp(1)",null,null,null,null,null,null,null,null,null,"Clique em J2 para usar estes pKas no cálculo de pH"]
["Ácido / Base protonação",{"$f":"K3","v":"Ácido fosfórico"},{"$f":"L3","v":"Ácido acético"},"Ácido clorídrico","Ácido carbônico","Hidróxido de sódio","Hidróxido de amônio","Ácido EDTA",null,"Ácido / Base","Ácido fosfórico","Ácido acético","Ácido clorídrico","Ácido carbônico","Hidróxido de sódio","Hidróxido de amônio","Ácido EDTA","Ácido / Base",{"$f":"K3","v":"Ácido fosfórico"},{"$f":"L3","v":"Ácido acético"},"Ácido clorídrico","Ácido carbônico","Hidróxido de sódio","Hidróxido de amônio","Ácido EDTA","Ácido / Base",{"$f":"IF(VLOOKUP(K$2,Constantes!$B$23:$N$303,2)=\"\",\"\",VLOOKUP(K$2,Constantes!$B$23:$N$303,2))","v":"Ácido fosfórico"},{"$f":"IF(VLOOKUP(L$2,Constantes!$B$23:$N$303,2)=\"\",\"\",VLOOKUP(L$2,Constantes!$B$23:$N$303,2))","v":"Ácido acético"},{"$f":"IF(VLOOKUP(M$2,Constantes!$B$23:$N$303,2)=\"\",\"\",VLOOKUP(M$2,Constantes!$B$23:$N$303,2))","v":"Ácido clorídrico"},{"$f":"IF(VLOOKUP(N$2,Constantes!$B$23:$N$303,2)=\"\",\"\",VLOOKUP(N$2,Constantes!$B$23:$N$303,2))","v":"Ácido carbônico"},{"$f":"IF(VLOOKUP(O$2,Constantes!$B$23:$N$303,2)=\"\",\"\",VLOOKUP(O$2,Constantes!$B$23:$N$303,2))","v":"Hidróxido de sódio"},{"$f":"IF(VLOOKUP(P$2,Constantes!$B$23:$N$303,2)=\"\",\"\",VLOOKUP(P$2,Constantes!$B$23:$N$303,2))","v":"Hidróxido de amônio"},{"$f":"IF(VLOOKUP(Q$2,Constantes!$B$23:$N$303,2)=\"\",\"\",VLOOKUP(Q$2,Constantes!$B$23:$N$303,2))","v":"Ácido EDTA"}]
["[B]",null,null,null,null,null,null,null,null,"Carga de B",-3,-1,-1,-2,-1,0,-4,"Carga de B",{"$f":"IF(K4=\"\",\"\",K4)","v":-3},{"$f":"IF(L4=\"\",\"\",L4)","v":-1},-1,-2,-1,0,-4,"Carga de B",{"$f":"IF(VLOOKUP(K$2,Constantes!$B$23:$N$303,3)=\"\",\"\",VLOOKUP(K$2,Constantes!$B$23:$N$303,3))","v":-3},{"$f":"IF(VLOOKUP(L$2,Constantes!$B$23:$N$303,3)=\"\",\"\",VLOOKUP(L$2,Constantes!$B$23:$N$303,3))","v":-1},{"$f":"IF(VLOOKUP(M$2,Constantes!$B$23:$N$303,3)=\"\",\"\",VLOOKUP(M$2,Constantes!$B$23:$N$303,3))","v":-1},{"$f":"IF(VLOOKUP(N$2,Constantes!$B$23:$N$303,3)=\"\",\"\",VLOOKUP(N$2,Constantes!$B$23:$N$303,3))","v":-2},{"$f":"IF(VLOOKUP(O$2,Constantes!$B$23:$N$303,3)=\"\",\"\",VLOOKUP(O$2,Constantes!$B$23:$N$303,3))","v":-1},{"$f":"IF(VLOOKUP(P$2,Constantes!$B$23:$N$303,3)=\"\",\"\",VLOOKUP(P$2,Constantes!$B$23:$N$303,3))","v":0},{"$f":"IF(VLOOKUP(Q$2,Constantes!$B$23:$N$303,3)=\"\",\"\",VLOOKUP(Q$2,Constantes!$B$23:$N$303,3))","v":-4}]
["[HB]",2.6499999999999999E-2,null,null,null,null,null,null,null,"pKa1",2.1480000000000001,4.7569999999999997,-7,6.3520000000000003,13.997,9.2439999999999998,-0.21,"bp1",{"$f":"IF(K5=\"\",\"\",IF(K6=\"\",10^K5,(IF(K7=\"\",10^K6,(IF(K8=\"\",10^K7,(IF(K9=\"\",10^K8,(IF(K10=\"\",10^K9,10^K10))))))))))","v":2238721138568.3457},57147.863667186728,9.9999999999999995E-8,21330449131.465843,99311604842093.641,1753880501.8417609,107151930523.76077,"pKa1 = logKpn",{"$f":"IF(VLOOKUP(K$2,Constantes!$B$23:$N$303,4)=\"\",\"\",VLOOKUP(K$2,Constantes!$B$23:$N$303,4))","v":2.1480000000000001},{"$f":"IF(VLOOKUP(L$2,Constantes!$B$23:$N$303,4)=\"\",\"\",VLOOKUP(L$2,Constantes!$B$23:$N$303,4))","v":4.7569999999999997},{"$f":"IF(VLOOKUP(M$2,Constantes!$B$23:$N$303,4)=\"\",\"\",VLOOKUP(M$2,Constantes!$B$23:$N$303,4))","v":-7},{"$f":"IF(VLOOKUP(N$2,Constantes!$B$23:$N$303,4)=\"\",\"\",VLOOKUP(N$2,Constantes!$B$23:$N$303,4))","v":6.3520000000000003},{"$f":"IF(VLOOKUP(O$2,Constantes!$B$23:$N$303,4)=\"\",\"\",VLOOKUP(O$2,Constantes!$B$23:$N$303,4))","v":13.997},{"$f":"IF(VLOOKUP(P$2,Constantes!$B$23:$N$303,4)=\"\",\"\",VLOOKUP(P$2,Constantes!$B$23:$N$303,4))","v":9.2439999999999998},{"$f":"IF(VLOOKUP(Q$2,Constantes!$B$23:$N$303,4)=\"\",\"\",VLOOKUP(Q$2,Constantes!$B$23:$N$303,4))","v":-0.21}]
["[H2B]",0.02,null,null,null,null,null,null,null,"pKa2",7.1989999999999998,"","",10.329000000000001,"","",1.5,"bp2",{"$f":"IF(K6=\"\",\"\",IF(K7=\"\",S5*10^K5,(IF(K8=\"\",S5*10^K6,(IF(K9=\"\",S5*10^K7,(IF(K10=\"\",S5*10^K8,S5*10^K9))))))))","v":3.539973410834362E+19},"","",4.7973344863669224E+16,"","",6.0255958607435917E+17,"pKa2 = logKpn-1",{"$f":"IF(VLOOKUP(K$2,Constantes!$B$23:$N$303,5)=\"\",\"\",VLOOKUP(K$2,Constantes!$B$23:$N$303,5))","v":7.1989999999999998},{"$f":"IF(VLOOKUP(L$2,Constantes!$B$23:$N$303,5)=\"\",\"\",VLOOKUP(L$2,Constantes!$B$23:$N$303,5))","v":""},{"$f":"IF(VLOOKUP(M$2,Constantes!$B$23:$N$303,5)=\"\",\"\",VLOOKUP(M$2,Constantes!$B$23:$N$303,5))","v":""},{"$f":"IF(VLOOKUP(N$2,Constantes!$B$23:$N$303,5)=\"\",\"\",VLOOKUP(N$2,Constantes!$B$23:$N$303,5))","v":10.329000000000001},{"$f":"IF(VLOOKUP(O$2,Constantes!$B$23:$N$303,5)=\"\",\"\",VLOOKUP(O$2,Constantes!$B$23:$N$303,5))","v":""},{"$f":"IF(VLOOKUP(P$2,Constantes!$B$23:$N$303,5)=\"\",\"\",VLOOKUP(P$2,Constantes!$B$23:$N$303,5))","v":""},{"$f":"IF(VLOOKUP(Q$2,Constantes!$B$23:$N$303,5)=\"\",\"\",VLOOKUP(Q$2,Constantes!$B$23:$N$303,5))","v":1.5}]
["[H3B]",null,null,null,null,null,null,null,null,"pKa3",12.35,"","","","","",2.21,"bp3",{"$f":"IF(K7=\"\",\"\",IF(K8=\"\",S6*10^K5,(IF(K9=\"\",S6*10^K6,(IF(K10=\"\",S6*10^K7,S6*10^K8))))))","v":4.9773708497893867E+21},"","","","","",7.7624711662869401E+20,"pKa3 = logKpn-2",{"$f":"IF(VLOOKUP(K$2,Constantes!$B$23:$N$303,6)=\"\",\"\",VLOOKUP(K$2,Constantes!$B$23:$N$303,6))","v":12.35},{"$f":"IF(VLOOKUP(L$2,Constantes!$B$23:$N$303,6)=\"\",\"\",VLOOKUP(L$2,Constantes!$B$23:$N$303,6))","v":""},{"$f":"IF(VLOOKUP(M$2,Constantes!$B$23:$N$303,6)=\"\",\"\",VLOOKUP(M$2,Constantes!$B$23:$N$303,6))","v":""},{"$f":"IF(VLOOKUP(N$2,Constantes!$B$23:$N$303,6)=\"\",\"\",VLOOKUP(N$2,Constantes!$B$23:$N$303,6))","v":""},{"$f":"IF(VLOOKUP(O$2,Constantes!$B$23:$N$303,6)=\"\",\"\",VLOOKUP(O$2,Constantes!$B$23:$N$303,6))","v":""},{"$f":"IF(VLOOKUP(P$2,Constantes!$B$23:$N$303,6)=\"\",\"\",VLOOKUP(P$2,Constantes!$B$23:$N$303,6))","v":""},{"$f":"IF(VLOOKUP(Q$2,Constantes!$B$23:$N$303,6)=\"\",\"\",VLOOKUP(Q$2,Constantes!$B$23:$N$303,6))","v":2.21}]
["[H4B]",null,null,null,null,null,null,null,null,"pKa4","","","","","","",3.11,"bp4",{"$f":"IF(K8=\"\",\"\",IF(K9=\"\",S7*10^K5,(IF(K10=\"\",S7*10^K6,S7*10^K7))))","v":""},"","","","","",1.2589254117941712E+23,"pKa4 = logKpn-3",{"$f":"IF(VLOOKUP(K$2,Constantes!$B$23:$N$303,7)=\"\",\"\",VLOOKUP(K$2,Constantes!$B$23:$N$303,7))","v":""},{"$f":"IF(VLOOKUP(L$2,Constantes!$B$23:$N$303,7)=\"\",\"\",VLOOKUP(L$2,Constantes!$B$23:$N$303,7))","v":""},{"$f":"IF(VLOOKUP(M$2,Constantes!$B$23:$N$303,7)=\"\",\"\",VLOOKUP(M$2,Constantes!$B$23:$N$303,7))","v":""},{"$f":"IF(VLOOKUP(N$2,Constantes!$B$23:$N$303,7)=\"\",\"\",VLOOKUP(N$2,Constantes!$B$23:$N$303,7))","v":""},{"$f":"IF(VLOOKUP(O$2,Constantes!$B$23:$N$303,7)=\"\",\"\",VLOOKUP(O$2,Constantes!$B$23:$N$303,7))","v":""},{"$f":"IF(VLOOKUP(P$2,Constantes!$B$23:$N$303,7)=\"\",\"\",VLOOKUP(P$2,Constantes!$B$23:$N$303,7))","v":""},{"$f":"IF(VLOOKUP(Q$2,Constantes!$B$23:$N$303,7)=\"\",\"\",VLOOKUP(Q$2,Constantes!$B$23:$N$303,7))","v":3.11}]
["[H5B]",null,null,null,null,null,null,null,"Total","pKa5","","","","","","",6.75,"bp5",{"$f":"IF(K9=\"\",\"\",IF(K10=\"\",S8*10^K5,S8*10^K6))","v":""},"","","","","",3.9810717055349867E+24,"pKa5 = logKpn-4",{"$f":"IF(VLOOKUP(K$2,Constantes!$B$23:$N$303,8)=\"\",\"\",VLOOKUP(K$2,Constantes!$B$23:$N$303,8))","v":""},{"$f":"IF(VLOOKUP(L$2,Constantes!$B$23:$N$303,8)=\"\",\"\",VLOOKUP(L$2,Constantes!$B$23:$N$303,8))","v":""},{"$f":"IF(VLOOKUP(M$2,Constantes!$B$23:$N$303,8)=\"\",\"\",VLOOKUP(M$2,Constantes!$B$23:$N$303,8))","v":""},{"$f":"IF(VLOOKUP(N$2,Constantes!$B$23:$N$303,8)=\"\",\"\",VLOOKUP(N$2,Constantes!$B$23:$N$303,8))","v":""},{"$f":"IF(VLOOKUP(O$2,Constantes!$B$23:$N$303,8)=\"\",\"\",VLOOKUP(O$2,Constantes!$B$23:$N$303,8))","v":""},{"$f":"IF(VLOOKUP(P$2,Constantes!$B$23:$N$303,8)=\"\",\"\",VLOOKUP(P$2,Constantes!$B$23:$N$303,8))","v":""},{"$f":"IF(VLOOKUP(Q$2,Constantes!$B$23:$N$303,8)=\"\",\"\",VLOOKUP(Q$2,Constantes!$B$23:$N$303,8))","v":6.75}]
["[H6B]",null,null,null,null,null,null,null,"SS","pKa6","","","","","","",11.03,"bp6",{"$f":"IF(K10=\"\",\"\",S9*10^K5)","v":""},"","","","","",2.4547089156850394E+24,"pKa6 = logKpn-5",{"$f":"IF(VLOOKUP(K$2,Constantes!$B$23:$N$303,9)=\"\",\"\",VLOOKUP(K$2,Constantes!$B$23:$N$303,9))","v":""},{"$f":"IF(VLOOKUP(L$2,Constantes!$B$23:$N$303,9)=\"\",\"\",VLOOKUP(L$2,Constantes!$B$23:$N$303,9))","v":""},{"$f":"IF(VLOOKUP(M$2,Constantes!$B$23:$N$303,9)=\"\",\"\",VLOOKUP(M$2,Constantes!$B$23:$N$303,9))","v":""},{"$f":"IF(VLOOKUP(N$2,Constantes!$B$23:$N$303,9)=\"\",\"\",VLOOKUP(N$2,Constantes!$B$23:$N$303,9))","v":""},{"$f":"IF(VLOOKUP(O$2,Constantes!$B$23:$N$303,9)=\"\",\"\",VLOOKUP(O$2,Constantes!$B$23:$N$303,9))","v":""},{"$f":"IF(VLOOKUP(P$2,Constantes!$B$23:$N$303,9)=\"\",\"\",VLOOKUP(P$2,Constantes!$B$23:$N$303,9))","v":""},{"$f":"IF(VLOOKUP(Q$2,Constantes!$B$23:$N$303,9)=\"\",\"\",VLOOKUP(Q$2,Constantes!$B$23:$N$303,9))","v":11.03}]
["S[HiB]",{"$f":"SUM(B4:B10)","v":4.65E-2},{"$f":"SUM(C4:C10)","v":0},0,0,0,0,0,{"$f":"SUM(B11:H11)","v":4.65E-2},"Eletrólito","Na+","K+","Ca++","Cl-","NO3-","ClO4-","-","Kw",{"$f":"10^-K13","v":1.0069316688518014E-14},null,null,null,null,null,null,"Temperatura",{"$f":"IF(VLOOKUP(K$2,Constantes!$B$23:$N$303,10)=\"\",\"indetermin.\",VLOOKUP(K$2,Constantes!$B$23:$N$303,10))","v":25},{"$f":"IF(VLOOKUP(L$2,Constantes!$B$23:$N$303,10)=\"\",\"indetermin.\",VLOOKUP(L$2,Constantes!$B$23:$N$303,10))","v":25},{"$f":"IF(VLOOKUP(M$2,Constantes!$B$23:$N$303,10)=\"\",\"indetermin.\",VLOOKUP(M$2,Constantes!$B$23:$N$303,10))","v":25},{"$f":"IF(VLOOKUP(N$2,Constantes!$B$23:$N$303,10)=\"\",\"indetermin.\",VLOOKUP(N$2,Constantes!$B$23:$N$303,10))","v":25},{"$f":"IF(VLOOKUP(O$2,Constantes!$B$23:$N$303,10)=\"\",\"indetermin.\",VLOOKUP(O$2,Constantes!$B$23:$N$303,10))","v":25},{"$f":"IF(VLOOKUP(P$2,Constantes!$B$23:$N$303,10)=\"\",\"indetermin.\",VLOOKUP(P$2,Constantes!$B$23:$N$303,10))","v":25},{"$f":"IF(VLOOKUP(Q$2,Constantes!$B$23:$N$303,10)=\"\",\"indetermin.\",VLOOKUP(Q$2,Constantes!$B$23:$N$303,10))","v":25}]
["S[H]",{"$f":"B5+2*B6+3*B7+4*B8+5*B9+6*B10","v":6.6500000000000004E-2},0,0,0,0,0,0,{"$f":"SUM(B12:H12)","v":6.6500000000000004E-2},"Carga do íon",1,1,2,-1,-1,-1,null,null,null,null,null,null,null,null,null,"Força Iônica",{"$f":"IF(VLOOKUP(K$2,Constantes!$B$23:$N$303,11)=\"\",\"indetermin.\",VLOOKUP(K$2,Constantes!$B$23:$N$303,11))","v":0},{"$f":"IF(VLOOKUP(L$2,Constantes!$B$23:$N$303,11)=\"\",\"indetermin.\",VLOOKUP(L$2,Constantes!$B$23:$N$303,11))","v":0},{"$f":"IF(VLOOKUP(M$2,Constantes!$B$23:$N$303,11)=\"\",\"indetermin.\",VLOOKUP(M$2,Constantes!$B$23:$N$303,11))","v":0},{"$f":"IF(VLOOKUP(N$2,Constantes!$B$23:$N$303,11)=\"\",\"indetermin.\",VLOOKUP(N$2,Constantes!$B$23:$N$303,11))","v":0},{"$f":"IF(VLOOKUP(O$2,Constantes!$B$23:$N$303,11)=\"\",\"indetermin.\",VLOOKUP(O$2,Constantes!$B$23:$N$303,11))","v":0},{"$f":"IF(VLOOKUP(P$2,Constantes!$B$23:$N$303,11)=\"\",\"indetermin.\",VLOOKUP(P$2,Constantes!$B$23:$N$303,11))","v":0},{"$f":"IF(VLOOKUP(Q$2,Constantes!$B$23:$N$303,11)=\"\",\"indetermin.\",VLOOKUP(Q$2,Constantes!$B$23:$N$303,11))","v":0}]
["SziCi",{"$f":"IF(K4=\"\",0,K4*B4+(K4+1)*B5+(K4+2)*B6+(K4+3)*B7+(K4+4)*B8+(K4+5)*B9+(K4+6)*B10)","v":-7.2999999999999995E-2},{"$f":"IF(L4=\"\",0,L4*C4+(L4+1)*C5+(L4+2)*C6+(L4+3)*C7+(L4+4)*C8+(L4+5)*C9+(L4+6)*C10)","v":0},0,0,0,0,0,{"$f":"SUM(B13:H13)","v":-7.2999999999999995E-2},"pKw",13.997]
["Eletrólito",{"$f":"K11","v":"Na+"},{"$f":"L11","v":"K+"},"Ca++","Cl-","NO3-","ClO4-","-",null," Parâm. Equação de Davies para",null,null,null,"código de cores"]
["Ci (mol/L)",7.2999999999999995E-2,null,null,0,null,null,null,null," estimativa de coefic. de atividade",null,null,null,"N ã o    a l t e r e  "]
["ziCi",{"$f":"B15*K12","v":7.2999999999999995E-2},0,0,0,0,0,0,{"$f":"SUM(B16:H16)","v":7.2999999999999995E-2},"A",0.50900000000000001,null,null," M u d e   c r I t e r o s a m e n t e"]
["Balanço de carga",{"$f":"IF(I17=0,\"Correto\", \"Atenção\")","v":"Correto"},{"$f":"IF(I17<0,\"Adicionar cátions ou retirar ânions\", \"\")","v":""},null,null,{"$f":"IF(I17>0,\"Adicionar ânions ou retirar cátions\", \"\")","v":""},null,{"$f":"IF(I17<>0,\"Desbalanço\",\"\")","v":""},{"$f":"I13+I16","v":0},"b",0.3,null,null,"Preencha, altere ou deixe em branco"]
[]
[]
[]
[]
["  Resultados - pH e Equilíbrio Químico",null,null,null,null,null,null,null,null,"   -log das constantes de protonação aparente recalculadas para I =",null,null,null,{"$f":"E26","v":9.9500751631900794E-2},null,null,null,"Constantes aparentes cumulativas de protonação para I",null,null,null,null,{"$f":"E26","v":9.9500751631900794E-2},null,null,null,"Como habilitar arquivos Excel com macros e usar o CurTiPot"]
["pH",7.0006187684125587,"a H+",9.9857625749919981E-8,"a OH-",1.0083660217604355E-7,"pOH",6.9963817968815158,null,"Ácido / Base",{"$f":"K3","v":"Ácido fosfórico"},{"$f":"L3","v":"Ácido acético"},"Ácido clorídrico","Ácido carbônico","Hidróxido de sódio","Hidróxido de amônio","Ácido EDTA","Ácido / Base",{"$f":"K3","v":"Ácido fosfórico"},{"$f":"L3","v":"Ácido acético"},"Ácido clorídrico","Ácido carbônico","Hidróxido de sódio","Hidróxido de amônio","Ácido EDTA",null,"Excel e Office para  Windows"]
["p[H]",6.8937560664612372,"[H+]",1.2771559574483629E-7,"[OH-]",1.2896768525251226E-7,"p[OH]",6.8895190949301943,null,"Carga de B",{"$f":"K4","v":-3},-1,-1,-2,-1,0,-4,"Carga de B",{"$f":"K4","v":-3},-1,-1,-2,-1,0,-4,null,"1. Baixe o arquivo CurTiPot do site do autor para um folder da sua preferência"]
["\"pH\"",7.3212041687220335,"\"[H+]\"",4.7730483233537674E-8,"\"[OH-]\"",2.1096169365511593E-7,"\"pOH\"",6.6757963965720428,null,"pK'an = logK'p1",11.708824287069081,4.5432747882173761,-7.2137256866102613,9.9015496093499973,15.531275231987562,9.2440003733356022,10.175098829855859,"b'p1",511474297107.32587,34936.114697246194,6.1132844616387423E-8,7971668116.1916504,3398400858129980.5,1753880501.8417609,14965747683.434774,null,"2. Abra o folder e clique com o botão direito no arquivo curtipot.xlsm"]
["g H+",0.78187495558041398,"     Força iônica, I (mol/L) ",null,9.9500751631900794E-2,null,"g OH-",0.78187495558041398,null,"pK'an-1 = logK'p2",6.7715494829393048,null,null,6.1382748526343276,null,null,6.1088240609029878,"b'p2",3.0225467276524339E+18,null,null,1.0960334639857812E+16,null,null,1.9227474015170404E+16,null,"3. Escolha \"Propriedades\" na janela que se abrir"]
["          Capacidade de tamponamento, CT",null,null,"Dmol.L-1/DpH",2.6247987914089322E-2,"     Força do tampão",null,1.139935677253579E-2,null,"pK'an-2 = logK'p3",1.9342746828482089,null,null,null,null,null,2.6825493177976694,"b'p3",2.5980507386339344E+20,null,null,null,null,null,9.2570251268758241E+18,null,"4. Assinale \"desbloquear\" (em geral, próximo ao canto inferior direito)"]
[" Carga média (zm) das espécies e protonação média (hm) das bases (conjugadas)",null,null,null,null,null,"para pH ",{"$f":"B23","v":7.0006187684125587},null,"pK'an-3 = logK'p4",null,null,null,null,null,null,1.9962746853521902,"b'p4",null,null,null,null,null,null,9.1779576056055202E+20,null,"5. Clique OK"]
["Ácido / Base",{"$f":"K3","v":"Ácido fosfórico"},"Ácido acético","Ácido clorídrico","Ácido carbônico","Hidróxido de sódio","Hidróxido de amônio","Ácido EDTA",null,"pK'an-4 = logK'p5",null,null,null,null,null,null,1.500000060580204,"b'p5",null,null,null,null,null,null,2.9023250302178821E+22,null,"6. Dê um clique duplo no arquivo curtipot.xlsm para abrí-lo"]
["zm",-1.569892445341402,-0.99555793329678188,-0.99999999999999223,-0.85159071312404988,-2.3039946617231521E-9,0.99555551393853325,-2.8595405669276062,null,"pK'an-5 = logK'p6",null,null,null,null,null,null,3.725395421414722E-3,"b'p6",null,null,null,null,null,null,2.9273283758336799E+22,null,"7. Escolha \"Habilitar conteúdo\", se a pregunta aparecer na barra de segurança "]
["hm",1.430107554658598,4.4420667032181579E-3,7.8076176697583672E-15,1.1484092868759501,0.99999999769600534,0.99555551393853325,1.1404594330723938,null,"pK'w",13.783275161391431,null,null,null,null,null,null,"K'w",1.6471205866017897E-14,null,null,null,null,null,null,null,"8. Leia a página de rosto do CurTiPot "]
["Concentração de equilíbrio das espécies, mol/L",null,null,null,null,null,null,null,null," Coeficiente de atividade (g) das espécies",null,null,null,"para pH =",{"$f":"B23","v":7.0006187684125587},"e para I =",{"$f":"E26","v":9.9500751631900794E-2},null,null,null,null,null,null,null,null,null,"9. Use o programa, seguindo as instruções"]
["Ácido / Base\nprotonação",{"$f":"K3","v":"Ácido fosfórico"},"Ácido acético","Ácido clorídrico","Ácido carbônico","Hidróxido de sódio","Hidróxido de amônio","Ácido EDTA","[H+]","Ácido / Base protonação",{"$f":"K3","v":"Ácido fosfórico"},"Ácido acético","Ácido clorídrico","Ácido carbônico","Hidróxido de sódio","Hidróxido de amônio","Ácido EDTA",null,null,null,null,null,null,null,null,null,"10. Salve seus dados, ajustes e resultados em arquivo Curtipot_qualquer_nome.xlsm"]
["[B]",4.0566581025196753E-7,null,null,null,null,null,null,{"$f":"D24","v":1.2771559574483629E-7},"g B",0.10920328964692329,0.78187495558041398,0.78187495558041398,0.37372246908913692,0.78187495558041398,1,1.9507285395505836E-2,null,null,null,null,null,null,null,null,null,"11. Feche o arquivo, momento em que também todas as macros serão removidas"]
["[HB]",2.649940693403156E-2,null,null,null,null,null,null,null,"g HB",0.37372246908913692,1,1,0.78187495558041398,1,0.78187495558041398,0.10920328964692329]
["[H2B]",1.9999967842881328E-2,null,null,null,null,null,null,"[OH-]","g H2B",0.78187495558041398,null,null,1,null,null,0.37372246908913692,null,null,null,null,null,null,null,null,null,"Versões anteriores do Office e do Excel"]
["[H3B]",2.1955727686129842E-7,null,null,null,null,null,null,{"$f":"F24","v":1.2896768525251226E-7},"g H3B",1,null,null,null,null,null,0.78187495558041398,null,null,null,null,null,null,null,null,null,"1. Abra o Excel com uma planilha em branco"]
["[H4B]",null,null,null,null,null,null,null,null,"g H4B",null,null,null,null,null,null,1,null,null,null,null,null,null,null,null,null,"2. Clique em Arquivo (canto superior esquerdo da tela)"]
["[H5B]",null,null,null,null,null,null,null,null,"g H5B",null,null,null,null,null,null,0.78187495558041398,null,null,null,null,null,null,null,null,null,"3. Clique em \"opções do Excel\" (canto inferior direito)"]
["[H6B]",null,null,null,null,null,null,null,"SS","g H6B",null,null,null,null,null,null,0.37372246908913692,null,null,null,null,null,null,null,null,null,"4. Clique em \"Central de Confiabilidade\""]
["S[HiB]",{"$f":"B34+B35+B36+B37+B38+B39+B40","v":4.65E-2},{"$f":"C34+C35+C36+C37+C38+C39+C40","v":0},0,0,0,0,0,{"$f":"SUM(B41:H41)","v":4.65E-2},null,null,null,null,null,null,null,null,null,null,null,null,null,null,null,null,null,"5. Clique em \"Configurações da Central de Confiabilidade\""]
[" Distribuição das espécies (composição fracionária, %)",null,null,null,"para pH =",{"$f":"B23","v":7.0006187684125587},"p[H] =",{"$f":"$B$24","v":6.8937560664612372},null,"Eletrólito",{"$f":"K11","v":"Na+"},"K+","Ca++","Cl-","NO3-","ClO4-","-",null,null,null,null,null,null,null,null,null,"6. Clique em \"Configurações de macro\""]
["Ácido / Base protonação",{"$f":"K3","v":"Ácido fosfórico"},"Ácido acético","Ácido clorídrico","Ácido carbônico","Hidróxido de sódio","Hidróxido de amônio","Ácido EDTA",null,"gi",0.78187495558041398,0.78187495558041398,0.37372246908913692,0.78187495558041398,0.78187495558041398,0.78187495558041398,null,null,null,null,null,null,null,null,null,null,"7. Assinale \"desabilitar todas as macros com notificação\""]
["% B",8.7239959193971517E-4,99.555793329678181,99.999999999999218,8.3480582132646336E-2,2.303994620474108E-7,0.44444860614667686,4.4923564218738013E-2,null,null,null,null,null,null,null,null,null,null,null,null,null,null,null,null,null,null,"8. Clique OK e OK; (não é preciso reconfigurar a cada dia)"]
["% HB",56.98797190114314,0.44420667032181577,7.8076176697583674E-13,84.992110148139702,99.999999769600535,99.555551393853321,85.865075904483774,null,null,null,null,null,null,null,null,null,null,null,null,null,null,null,null,null,null,"9. Feche e reabra o Excel; carregue curtipot.xlsm"]
["% H2B",43.010683533078122,null,null,14.924409269727654,null,null,14.089134202106679,null,null,null,null,null,null,null,null,null,null,null,null,null,null,null,null,null,null,"10. Clique \"Habilitar este Conteúdo\"  no"]
["% H3B",4.7216618679849122E-4,null,null,null,null,null,8.6631822104069815E-4]
["% H4B",null,null,null,null,null,null,1.0969731233323473E-8]
["% H5B",null,null,null,null,null,null,4.4303692154282471E-14]
["% H6B",null,null,null,null,null,null,5.7070180944934333E-21]
["% S[HiB]",{"$f":"B44+B45+B46+B47+B48+B49+B50","v":100},{"$f":"C44+C45+C46+C47+C48+C49+C50","v":100},100,100,100,100,100]
[]
[]
[]
[]
[]
[null,"Cálculo de pH com processamento em lote"]
["Ident. Amostra","  Espécies adicionadas à solução, em mol/L",null,null,null,null,null,"pH e outros parâmetros calculados"]
["Ident. célula .","B5","B6","D5","G4","E6",null,"B23","E26","K35","K36","B45","E27"]
["Espécie","HPO4=","H2PO4-","HCl","NH4OH","CO2","log HB/H2B","pH","I","g HPO4=","g H2PO4-","% HPO4=","buff. cap."]
["Razão mistura 1",0.01,0.04,null,null,null,{"$f":"LOG10(B61/C61)","v":-0.6020599913279624},6.2936061420633633,8.3003553082661399E-2,0.39383748975787858,0.79218983175513413,20.005653138797719,1.843363257800508E-2]
[2,{"$f":"B61+0.001","v":1.0999999999999999E-2},{"$f":"C61-0.001","v":3.9E-2},null,null,null,-0.54967192186827418,6.3448296532594348,8.4003110798025638E-2,0.39247151570866196,0.79150203471330238,22.004869381950932,1.9767454485428524E-2]
[3,{"$f":"B62+0.001","v":1.2E-2},{"$f":"C62-0.001","v":3.7999999999999999E-2},null,null,null,-0.50060235056918523,6.3927559133775702,8.5002745372725397E-2,0.39112656605138996,0.79082306751931808,24.004210094918911,2.1009474711239887E-2]
[4,1.3000000000000001E-2,3.6999999999999998E-2,null,null,null,-0.45425837176015815,6.4379753138848006,8.6002439385612528E-2,0.38980217629745922,0.79015276626011177,26.003645320516195,2.2159625473890235E-2]
[5,1.4000000000000002E-2,3.5999999999999997E-2,null,null,null,-0.41017446508904915,6.4809516421812887,8.70021804041822E-2,0.38849789035047894,0.78949096850981793,28.003153500308713,2.3217858495545585E-2]
[6,1.5000000000000003E-2,3.4999999999999996E-2,null,null,null,-0.36797678529459427,6.5220574919636967,8.800195930447019E-2,0.38721326250738364,0.78883751443577454,30.00271861887861,2.4184138515582692E-2]
[7,1.6000000000000004E-2,3.3999999999999996E-2,null,null,null,-0.32735893438633018,6.5615983202731867,8.9001769293751989E-2,0.38594785838479717,0.78819224736964355,32.002328539417498,2.5058439299339749E-2]
[8,1.7000000000000005E-2,3.2999999999999995E-2,null,null,null,-0.28806501849961336,6.5998292851203946,9.0001605206344773E-2,0.38470125540936823,0.78755501416070983,34.001973795092212,2.5840740988791862E-2]
[9,1.8000000000000006E-2,3.1999999999999994E-2,null,null,null,-0.24987747321659964,6.6369673562728648,9.100146310407356E-2,0.38347304287638256,0.78692566530959485,36.001646881216956,2.6531028385410858E-2]
[10,1.9000000000000006E-2,3.0999999999999993E-2,null,null,null,-0.21260809288144347,6.673200243526666,9.2001339920416883E-2,0.38226282193322625,0.786304055061958,38.001341701079014,2.7129289747243997E-2]
[11,2.0000000000000007E-2,2.9999999999999992E-2,null,null,null,-0.17609125905568099,6.7086931323578582,9.3001233001230907E-2,0.38107020566931438,0.78569004155516076,40.00105273087086,2.7635515854186225E-2]
[12,2.1000000000000008E-2,2.8999999999999991E-2,null,null,null,-0.14017870316503647,6.7435939217343854,9.4001140609828338E-2,0.37989481805561276,0.78508348636944358,42.000775839210789,2.8049699728525741E-2]
[13,2.2000000000000009E-2,2.799999999999999E-2,null,null,null,-0.10473535052001262,6.778037350223113,9.5001061298464556E-2,0.37873629426196154,0.78448425478324935,44.00050716378724,2.8371835942893917E-2]
[14,2.300000000000001E-2,2.6999999999999989E-2,null,null,null,-6.9635928141394091E-2,6.8121483783649541,9.6000993708436802E-2,0.37759428044592147,0.78389221575490553,46.000242914272413,2.8601920380946461E-2]
[15,2.4000000000000011E-2,2.5999999999999988E-2,null,null,null,-3.4762106259211549E-2,6.8450832331827538,9.8000939196849116E-2,0.3753583640843009,0.78272917977619805,47.999980882814938,2.8739955631235516E-2]
[16,2.5000000000000012E-2,2.4999999999999988E-2,null,null,null,3.8573098662131469E-16,6.8779491359623215,0.10000089475956316,0.37318452516162931,0.78159344179321244,49.999716143249366,2.8785933565184114E-2]
[17,2.6000000000000013E-2,2.3999999999999987E-2,null,null,null,3.4762106259212354E-2,6.9108563406756716,0.10200085954814506,0.37107027770429574,0.78048406812188764,51.999444900634096,2.8739853392199331E-2]
[18,2.7000000000000014E-2,2.2999999999999986E-2,null,null,null,6.9635928141394882E-2,6.9439151903412428,0.10400083376812447,0.36901327614363427,0.7794001729158172,53.999164387936752,2.8601715177749131E-2]
[19,2.8000000000000014E-2,2.1999999999999985E-2,null,null,null,0.10473535052001351,6.977238247712422,0.10600081731503497,0.36701130641748086,0.77834091559470708,55.998870956670501,2.837151983594962E-2]
[20,2.9000000000000015E-2,2.0999999999999984E-2,null,null,null,0.14017870316503736,7.0109425671711456,0.10800080997692327,0.36506227626946802,0.77730549765764656,57.998560249337885,2.8049269276226654E-2]
[21,3.0000000000000016E-2,1.9999999999999983E-2,null,null,null,0.17609125905568182,7.045152205025345,0.1100008124038066,0.36316420570000241,0.77629315938754651,59.998228277317509,2.7634966302633637E-2]
[22,3.1000000000000017E-2,1.8999999999999982E-2,null,null,null,0.21260809288144436,7.080001042644354,0.11200082498656047,0.36131522021452461,0.77530317787673864,61.997869730216017,2.7128614988338733E-2]
[23,3.2000000000000015E-2,1.7999999999999981E-2,null,null,null,0.24987747321660053,7.1156361802964883,0.11400084844342927,0.3595135430571979,0.77433486436881926,63.997478513820759,2.6530220807112207E-2]
[24,3.3000000000000015E-2,1.699999999999998E-2,null,null,null,0.28806501849961424,7.1522220783829971,0.11600088386351096,0.35775748860211498,0.77338756208240766,65.997047401149601,2.5839790952089586E-2]
[25,3.4000000000000016E-2,1.599999999999998E-2,null,null,null,0.32735893438633107,7.189945772923787,0.11800093266056222,0.35604545636687096,0.77246064424871463,67.996567435420332,2.5057334864971158E-2]
[26,3.5000000000000017E-2,1.4999999999999979E-2,null,null,null,0.36797678529459527,7.229023625557196,0.12000099669204013,0.35437592537205587,0.77155351222614188,69.996027568208106,2.4182864836737327E-2]
[27,3.6000000000000018E-2,1.3999999999999978E-2,null,null,null,0.41017446508905014,7.2697102521537635,0.12200107852583726,0.35274744883819825,0.77066559369659915,71.995413597767566,2.3216397083675667E-2]
[28,3.7000000000000019E-2,1.2999999999999977E-2,null,null,null,0.45425837176015921,7.3123106488284773,0.12400118163519676,0.35115864936935548,0.76979634103404482,73.994707336005064,2.2157953021417431E-2]
[29,3.800000000000002E-2,1.1999999999999976E-2,null,null,null,0.50060235056918645,7.357197028697029,0.12600131025954539,0.3496082147741954,0.76894522993840397,75.993884012475448,2.1007561872330421E-2]
[30,3.9000000000000021E-2,1.0999999999999975E-2,null,null,null,0.5496719218682754,7.4048329375343771,0.12800147106320345,0.3480948928529668,0.76811175742428195,77.992911045863877,1.9765263186527753E-2]
[31,4.0000000000000022E-2,9.9999999999999742E-3,null,null,null,0.60205999132796373,7.4558086834132817,0.1300016729117312,0.34661748803147097,0.76729544074922473,79.991742269774207,1.8431112972624328E-2]
["pH7 referência",2.6499999999999999E-2,0.02,0,null,null,null,7.0006187684125587,9.9500751631900794E-2,0.37372246908913692,0.78187495558041398,56.98797190114314,2.6247987914089322E-2]
["Adição HCl 1",2.6499999999999999E-2,0.02,{"$f":"D92+0.001","v":1E-3},null,null,null,6.9636745977842249,9.8500767961440361E-2,0.37480935848937758,0.78244281437424501,54.837757686190102,2.6520255719215253E-2]
[2,2.6499999999999999E-2,0.02,{"$f":"D93+0.001","v":2E-3},null,null,null,6.9270582424009959,9.7500790421509387E-2,0.37591160223040754,0.78301743531024037,52.687522093170521,2.6693538907974258E-2]
[3,2.6499999999999999E-2,0.02,3.0000000000000001E-3,null,null,null,6.8906268497554173,9.6500830690573941E-2,0.37702950709139643,0.78359893140482639,50.537285804238365,2.6767835296374894E-2]
[4,2.6499999999999999E-2,0.02,4.0000000000000001E-3,null,null,null,6.8542409558175024,9.5500877394575481E-2,0.37816341516035851,0.78418743230581289,48.387036917835111,2.6743145666975495E-2]
[5,2.6499999999999999E-2,0.02,5.0000000000000001E-3,null,null,null,6.8177622416827761,9.4500935143182252E-2,0.37931366086422424,0.78478306183968538,46.236785156241375,2.6619470679663523E-2]
[6,2.6499999999999999E-2,0.02,6.0000000000000001E-3,null,null,null,6.7810499703782376,9.3501004677205443E-2,0.38048059340864182,0.78538594961491082,44.086534535548196,2.639681245300211E-2]
[7,2.6499999999999999E-2,0.02,7.0000000000000001E-3,null,null,null,6.7439578423192623,9.2501086864954965E-2,0.38166457276251825,0.78599622884452092,41.936288953757568,2.6075174301963173E-2]
[8,2.6499999999999999E-2,0.02,8.0000000000000002E-3,null,null,null,6.706330452787947,9.1501183342152195E-2,0.3828659693258547,0.78661403608755842,39.786053189981615,2.565456104697476E-2]
[9,2.6499999999999999E-2,0.02,9.0000000000000011E-3,null,null,null,6.6679991733858239,9.0501295902423409E-2,0.38408516508615287,0.78723951175415174,37.63583217180684,2.5134979183403877E-2]
[10,2.6499999999999999E-2,0.02,1.0000000000000002E-2,null,null,null,6.6287772160787695,8.9501426698640502E-2,0.38532255385179726,0.78787280012866856,35.485631319939003,2.4516437243760115E-2]
[11,2.6499999999999999E-2,0.02,1.1000000000000003E-2,null,null,null,6.5884534935616585,8.8501579328233784E-2,0.38657854036954414,0.78851404882036413,33.335458119418881,2.3798946779721674E-2]
[12,2.6499999999999999E-2,0.02,1.2000000000000004E-2,null,null,null,6.5467846331604473,8.7501757249206599E-2,0.38785354277231898,0.78916340991294476,31.185320142290923,2.298252247767266E-2]
[13,2.6499999999999999E-2,0.02,1.3000000000000005E-2,null,null,null,6.5034844782677048,8.6501965814426568E-2,0.38914799051434318,0.78982103880410037,29.035227928924023,2.2067184103624637E-2]
[14,2.6499999999999999E-2,0.02,1.4000000000000005E-2,null,null,null,6.4582096843886241,8.5502211882200529E-2,0.39046232530353497,0.79048709457581967,26.885194712819089,2.1052957985913265E-2]
[15,2.6499999999999999E-2,0.02,1.5000000000000006E-2,null,null,null,6.4105395390979032,8.4502504825254315E-2,0.39179700022097497,0.79116173944052559,24.735238145972126,1.9939879992092003E-2]
[16,2.6499999999999999E-2,0.02,1.6000000000000007E-2,null,null,null,6.3599467655677779,8.3502857628305699E-2,0.39315247861569019,0.79184513807908308,22.585382291705997,1.8727999952156904E-2]
[17,2.6499999999999999E-2,0.02,1.7000000000000008E-2,null,null,null,6.3057538873900709,8.250328885640118E-2,0.39452923166626935,0.79253745631629391,20.435661196005821,1.7417389041197349E-2]
[18,2.6499999999999999E-2,0.02,1.8000000000000009E-2,null,null,null,6.2470654688372775,8.150382555070293E-2,0.39592773438313017,0.79323885903330915,18.286124179525387,1.6008151884198123E-2]
[19,2.6499999999999999E-2,0.02,1.900000000000001E-2,null,null,null,6.1826581603697761,8.0504509459306442E-2,0.39734845643160632,0.79394950552408328,16.136846962408306,1.4500449304913607E-2]
[20,2.6499999999999999E-2,0.02,2.0000000000000011E-2,null,null,null,6.1107922512989337,7.9505407887979815E-2,0.39879184532617262,0.79466954112579891,13.987951298043916,1.2894540970361999E-2]
[21,2.6499999999999999E-2,0.02,2.1000000000000012E-2,null,null,null,6.0288662135330169,7.8506636920535444E-2,0.40025828967427451,0.79539907907757623,11.839646822028111,1.1190874845236915E-2]
[22,2.6499999999999999E-2,0.02,2.2000000000000013E-2,null,null,null,5.932725590900227,7.7508415198301719E-2,0.40174803284011162,0.79613815812603339,9.6923279844555559,9.3902947924946484E-3]
[23,2.6499999999999999E-2,0.02,2.3000000000000013E-2,null,null,null,5.8151072091051219,7.6511208728014465E-2,0.40326093885374531,0.79688662787093945,7.5468350659165022,7.4945996035418747E-3]
[24,2.6499999999999999E-2,0.02,2.4000000000000014E-2,null,null,null,5.6614885067595377,7.5516215741722584E-2,0.40479570616138966,0.79764376410965543,5.4053280615206942,5.5084146040096866E-3]
[25,2.6499999999999999E-2,0.02,2.5000000000000015E-2,null,null,null,5.4355900462654816,7.4527696658083301E-2,0.40634608463358096,0.79840641889373187,3.2754860134402075,3.4481868637868365E-3]
[26,2.6499999999999999E-2,0.02,2.6000000000000016E-2,null,null,null,4.9969114832944124,7.3577128703681438E-2,0.40786162949016602,0.79914983201136269,1.2140341265551353,1.4354405730686978E-3]
["pH7 referência",2.6499999999999999E-2,0.02,null,0,null,null,7.0006187684125587,9.9500751631900794E-2,0.37372246908913692,0.78187495558041398,56.98797190114314,2.6247987914089322E-2]
["Adic. Amônia 1",2.6499999999999999E-2,0.02,null,{"$f":"E119+0.001","v":1E-3},null,null,7.0369384635466696,0.101491100652709,0.37160363765125914,0.78076437536844978,59.127793089808023,2.5889823000154903E-2]
[2,2.6499999999999999E-2,0.02,null,{"$f":"E120+0.001","v":2E-3},null,null,7.0738893174195221,0.10347978415231597,0.36954379363689666,0.77968015111672773,61.265784667428235,2.5435976155649062E-2]
[3,2.6499999999999999E-2,0.02,null,3.0000000000000001E-3,null,null,7.1116369449582484,0.10546652302306185,0.36754086373266764,0.77862152908258031,63.401639318117951,2.4887103383688755E-2]
[4,2.6499999999999999E-2,0.02,null,4.0000000000000001E-3,null,null,7.1503645897459398,0.10745096990771819,0.36559294374656176,0.77758782351713218,65.53497439046599,2.4244017942012659E-2]
[5,2.6499999999999999E-2,0.02,null,5.0000000000000001E-3,null,null,7.1902786418764455,0.10943268797506549,0.36369830328672298,0.77657842141904554,67.665308530116491,2.3507739959686729E-2]
[6,2.6499999999999999E-2,0.02,null,6.0000000000000001E-3,null,null,7.2316156028146334,0.11141112243701104,0.36185539557139962,0.77559279000654191,69.792030900769802,2.2679564842321968E-2]
[7,2.6499999999999999E-2,0.02,null,7.0000000000000001E-3,null,null,7.2746509372052719,0.11338555687517944,0.36006287854090296,0.77463049029602393,71.914352659321182,2.176116208621303E-2]
[8,2.6499999999999999E-2,0.02,null,8.0000000000000002E-3,null,null,7.3197106779734842,0.11535505163995796,0.35831964763551899,0.77369119713210055,74.031239131144488,2.0754717913344E-2]
[9,2.6499999999999999E-2,0.02,null,9.0000000000000011E-3,null,null,7.367186843821985,0.11731835303926044,0.35662488773897677,0.77277472987238927,76.141310102473298,1.9663146086481075E-2]
[10,2.6499999999999999E-2,0.02,null,1.0000000000000002E-2,null,null,7.4175580885317496,0.11927375343444288,0.35497815742923838,0.77188110109685171,78.242685575985121,1.8490409066719882E-2]
[11,2.6499999999999999E-2,0.02,null,1.1000000000000003E-2,null,null,7.4714176717054768,0.12121887463245967,0.35337952237509601,0.77101059289778118,80.332747413650608,1.7242016881158301E-2]
[12,2.6499999999999999E-2,0.02,null,1.2000000000000004E-2,null,null,7.5295112252749767,0.12315032024234482,0.35182977268724636,0.77016388034021122,82.40775664103947,1.5925824989118532E-2]
[13,2.6499999999999999E-2,0.02,null,1.3000000000000005E-2,null,null,7.5927867747757407,0.12506310294968928,0.35033078345763929,0.76934223550661984,84.462222963112197,1.4553344945702894E-2]
[14,2.6499999999999999E-2,0.02,null,1.4000000000000005E-2,null,null,7.6624569692269286,0.12694967662312887,0.34888612509561229,0.76854787229088362,86.487839322902232,1.3141951220278024E-2]
[15,2.6499999999999999E-2,0.02,null,1.5000000000000006E-2,null,null,7.7400626466290836,0.12879827097346364,0.3475021110223474,0.76778453792105361,88.471648598016003,1.1718657686579134E-2]
[16,2.6499999999999999E-2,0.02,null,1.6000000000000007E-2,null,null,7.827490881918771,0.13059004290594789,0.34618957727687627,0.76705851813703152,90.392907987887256,1.0326527057016055E-2]
[17,2.6499999999999999E-2,0.02,null,1.7000000000000008E-2,null,null,7.9267973188348959,0.13229451553711499,0.34496668920300488,0.76638022515299242,92.218068262272979,9.0347864291585069E-3]
[18,2.6499999999999999E-2,0.02,null,1.8000000000000009E-2,null,null,8.0394562405181471,0.13386395013121585,0.34386225772103929,0.76576608430347937,93.89457894673096,7.9508595996560308E-3]
[19,2.6499999999999999E-2,0.02,null,1.900000000000001E-2,null,null,8.1644973785033201,0.13523271647778451,0.342915520759765,0.7652384538637873,95.350196557336886,7.2200201734441841E-3]
[20,2.6499999999999999E-2,0.02,null,2.0000000000000011E-2,null,null,8.2961147225185545,0.13633707527518013,0.34216262912830947,0.76481807584127903,96.514763405793232,6.97810481308453E-3]
[21,2.6499999999999999E-2,0.02,null,2.1000000000000012E-2,null,null,8.4244180586641644,0.13715741359316957,0.34160959847866579,0.76450884829403565,97.366701573222599,7.2564638022357946E-3]
[22,2.6499999999999999E-2,0.02,null,2.2000000000000013E-2,null,null,8.5409916103202512,0.13773543862578311,0.34122307289893916,0.76429249921208908,97.951936484383182,7.9498188726414322E-3]
[23,2.6499999999999999E-2,0.02,null,2.3000000000000013E-2,null,null,8.6426832214431588,0.13813990385397151,0.34095414128710133,0.76414186227793213,98.346163394381833,8.9000650821167097E-3]
[24,2.6499999999999999E-2,0.02,null,2.4000000000000014E-2,null,null,8.7302688795788708,0.13843027708233335,0.34076184431003087,0.7640340961294374,98.614851617204522,9.977951350886978E-3]
[25,2.6499999999999999E-2,0.02,null,2.5000000000000015E-2,null,null,8.8059303333568213,0.1386469686196809,0.34061876199061375,0.76395388102469131,98.802488777457881,1.1101472892493101E-2]
[26,2.6499999999999999E-2,0.02,null,2.6000000000000016E-2,null,null,8.8719052117203674,0.13881526096605859,0.3405078844666975,0.76389170325731304,98.936907952443093,1.2224099918395454E-2]
["pH7 referência",2.6499999999999999E-2,0.02,null,null,0,null,7.0006187684125587,9.9500751631900794E-2,0.37372246908913692,0.78187495558041398,56.98797190114314,2.6247987914089322E-2]
["Absorção CO2 1",2.6499999999999999E-2,0.02,null,null,{"$f":"F146+0.001","v":1E-3},null,6.9694818581685807,9.8659433428352455E-2,0.3746358866827918,0.78235226478586217,55.177281208438714,2.6793549442460079E-2]
["do ar 2",2.6499999999999999E-2,0.02,null,null,{"$f":"F147+0.001","v":2E-3},null,6.9392998386951295,9.7837305460522481E-2,0.37553893781982811,0.78282329972568365,53.408089824913908,2.7295330507938264E-2]
[3,2.6499999999999999E-2,0.02,null,null,3.0000000000000001E-3,null,6.9099949679403823,9.7034844183834151E-2,0.37643053594777642,0.7832875280435746,51.681388343671443,2.7757489106203018E-2]
[4,2.6499999999999999E-2,0.02,null,null,4.0000000000000001E-3,null,6.881501553902619,9.6252488895900989E-2,0.37730960961767279,0.78374442858370352,49.998092855597143,2.8184069236815358E-2]
[5,2.6499999999999999E-2,0.02,null,null,5.0000000000000001E-3,null,6.8537639789653282,9.5490635041949073E-2,0.37817511359473327,0.78419349691864126,48.359029732404224,2.857897788684953E-2]
[6,2.6499999999999999E-2,0.02,null,null,6.0000000000000001E-3,null,6.8267351009646626,9.4749628486008722E-2,0.37902603943258445,0.78463425053706559,46.764922356843478,2.8945962055561675E-2]
[7,2.6499999999999999E-2,0.02,null,null,7.0000000000000001E-3,null,6.8003749235316056,9.4029760041784038E-2,0.3798614262122994,0.78506623406192055,45.216378735986886,2.9288586792906066E-2]
[8,2.6499999999999999E-2,0.02,null,null,8.0000000000000002E-3,null,6.7746494828889068,9.3331260828604323E-2,0.380680370713535,0.78548902412546984,43.713880840804912,2.9610215014956056E-2]
[9,2.6499999999999999E-2,0.02,null,null,9.0000000000000011E-3,null,6.7495298837904762,9.265429767839177E-2,0.3814820378215984,0.78590223432424899,42.257774675620198,2.9913989729636537E-2]
[10,2.6499999999999999E-2,0.02,null,null,1.0000000000000002E-2,null,6.7249914980237593,9.1998970611245942E-2,0.38226566869069134,0.78630551898321777,40.848264121219607,3.0202819421187292E-2]
[11,2.6499999999999999E-2,0.02,null,null,1.1000000000000003E-2,null,6.7010132480794145,9.136531037807695E-2,0.38303058887317359,0.78669857688197276,39.4854056377769,3.0479366933363075E-2]
[12,2.6499999999999999E-2,0.02,null,null,1.2000000000000004E-2,null,6.6775769948451513,9.075327761427629E-2,0.38377621447311638,0.78708115395275025,38.169106155769278,3.0746042298837647E-2]
[13,2.6499999999999999E-2,0.02,null,null,1.3000000000000005E-2,null,6.6546670012266755,9.0162763039586966E-2,0.38450205685338634,0.78745304523628334,36.899123336654895,3.1004999646713809E-2]
[14,2.6499999999999999E-2,0.02,null,null,1.4000000000000005E-2,null,6.6322694655197196,8.9593588835074803E-2,0.3852077256193191,0.78781409596502516,35.675068386871196,3.1258138208074743E-2]
["pH7 referência",2.6499999999999999E-2,0.02,null,null,null,null,7.0006187684125587,9.9500751631900794E-2,0.37372246908913692,0.78187495558041398,56.98797190114314,2.6247987914089322E-2]

{"sheet":"+pH","index":2,"n_rows":4,"n_cols":3,"rows_kept":4,"cut":false,"hidden":false,"merged":[]}
[null,"           ","Compilação de dados e resultados de cálculos de pH"]
[]
[]
[null,"Identifique os resultados e acrescente observações (nas células em cinza)"]

{"sheet":"Titulador","index":3,"n_rows":93,"n_cols":39,"rows_kept":93,"cut":false,"hidden":false,"merged":[]}
[null,"          Titulador virtual manual com indicador visual ",null,null,null,null,null,"<--- leia instruções",null,null,"  pKa dos ácidos e bases em solução",null,null,"Clique em K2 a Q2; selecione ácidos/bases; clique em J2; leia M1",null,null,null,null,null,null,"     Constantes cumulativas de protonação = bp = PKp (calculado pela planilha)",null,null,null,null,null,"  pKa(n) = -log Kd(HB-->B) = log Kp(1)",null,null,null,null,"       pKas dos ácidos HiB, carregados da planilha Constantes "]
["   Composição da amostra hipotética (titulado) e do titulante (concentrações em mol/L)",null,null,null,null,null,null,null,null,null,4,2,1,264,7,8,181,null,"Titulante",null,null,"Titulado",null,null,null,null,null,null,"Titulante",null,null,null,"    Titulado","Clique em J2 para usar estes pKas na simulação"]
["AMOSTRA Espécie",{"$f":"K3","v":"Ácido clorídrico"},{"$f":"L3","v":"Ácido carbônico"},"Ácido acético","Vermelho de fenol (pKa 7,7)","Hidróxido de amônio","Hidróxido de sódio","o-Fenotidina",null,"Ácido / Base","Ácido clorídrico","Ácido carbônico","Ácido acético","Vermelho de fenol (pKa 7,7)","Hidróxido de amônio","Hidróxido de sódio","o-Fenotidina","Ácido forte","Base forte","Ác. carbônico","Ácido / Base",{"$f":"IF(K3=\"\",\"\",K3)","v":"Ácido clorídrico"},"Ácido carbônico","Ácido acético","Vermelho de fenol (pKa 7,7)","Hidróxido de amônio","Hidróxido de sódio","o-Fenotidina",{"$f":"R3","v":"Ácido forte"},{"$f":"S3","v":"Base forte"},{"$f":"T3","v":"Ác. carbônico"},"Ácido / Base",{"$f":"IF(VLOOKUP(K$2,Constantes!$B$23:$N$303,2)=\"\",\"\",VLOOKUP(K$2,Constantes!$B$23:$N$303,2))","v":"Ácido clorídrico"},{"$f":"IF(VLOOKUP(L$2,Constantes!$B$23:$N$303,2)=\"\",\"\",VLOOKUP(L$2,Constantes!$B$23:$N$303,2))","v":"Ácido carbônico"},{"$f":"IF(VLOOKUP(M$2,Constantes!$B$23:$N$303,2)=\"\",\"\",VLOOKUP(M$2,Constantes!$B$23:$N$303,2))","v":"Ácido acético"},{"$f":"IF(VLOOKUP(N$2,Constantes!$B$23:$N$303,2)=\"\",\"\",VLOOKUP(N$2,Constantes!$B$23:$N$303,2))","v":"Vermelho de fenol (pKa 7,7)"},{"$f":"IF(VLOOKUP(O$2,Constantes!$B$23:$N$303,2)=\"\",\"\",VLOOKUP(O$2,Constantes!$B$23:$N$303,2))","v":"Hidróxido de amônio"},{"$f":"IF(VLOOKUP(P$2,Constantes!$B$23:$N$303,2)=\"\",\"\",VLOOKUP(P$2,Constantes!$B$23:$N$303,2))","v":"Hidróxido de sódio"},{"$f":"IF(VLOOKUP(Q$2,Constantes!$B$23:$N$303,2)=\"\",\"\",VLOOKUP(Q$2,Constantes!$B$23:$N$303,2))","v":"o-Fenotidina"}]
["[B]",null,null,null,null,null,null,null,null,"Carga de B",-1,-2,-1,-2,0,-1,0,-1,-1,-2,"Carga de B",-1,-2,-1,-2,0,-1,0,{"$f":"IF(R4=\"\",\"\",R4)","v":-1},{"$f":"IF(S4=\"\",\"\",S4)","v":-1},{"$f":"IF(T4=\"\",\"\",T4)","v":-2},"Carga de B",{"$f":"IF(VLOOKUP(K$2,Constantes!$B$23:$N$303,3)=\"\",\"\",VLOOKUP(K$2,Constantes!$B$23:$N$303,3))","v":-1},{"$f":"IF(VLOOKUP(L$2,Constantes!$B$23:$N$303,3)=\"\",\"\",VLOOKUP(L$2,Constantes!$B$23:$N$303,3))","v":-2},{"$f":"IF(VLOOKUP(M$2,Constantes!$B$23:$N$303,3)=\"\",\"\",VLOOKUP(M$2,Constantes!$B$23:$N$303,3))","v":-1},{"$f":"IF(VLOOKUP(N$2,Constantes!$B$23:$N$303,3)=\"\",\"\",VLOOKUP(N$2,Constantes!$B$23:$N$303,3))","v":-2},{"$f":"IF(VLOOKUP(O$2,Constantes!$B$23:$N$303,3)=\"\",\"\",VLOOKUP(O$2,Constantes!$B$23:$N$303,3))","v":0},{"$f":"IF(VLOOKUP(P$2,Constantes!$B$23:$N$303,3)=\"\",\"\",VLOOKUP(P$2,Constantes!$B$23:$N$303,3))","v":-1},{"$f":"IF(VLOOKUP(Q$2,Constantes!$B$23:$N$303,3)=\"\",\"\",VLOOKUP(Q$2,Constantes!$B$23:$N$303,3))","v":0}]
["[HB]",null,null,0.1,null,null,null,null,null,"pKa1",-7,6.3520000000000003,4.7569999999999997,1.2,9.2439999999999998,13.997,4.43,-6,13.997,6.3520000000000003,"bp1",{"$f":"IF(K5=\"\",\"\",IF(K6=\"\",10^K5,(IF(K7=\"\",10^K6,(IF(K8=\"\",10^K7,(IF(K9=\"\",10^K8,(IF(K10=\"\",10^K9,10^K10))))))))))","v":9.9999999999999995E-8},21330449131.465843,57147.863667186728,50118723.362727284,1753880501.8417609,99311604842093.641,26915.348039269167,{"$f":"IF(R5=\"\",\"\",IF(R6=\"\",10^R5,10^R6))","v":9.9999999999999995E-7},{"$f":"IF(S5=\"\",\"\",IF(S6=\"\",10^S5,10^S6))","v":99311604842093.641},{"$f":"IF(T5=\"\",\"\",IF(T6=\"\",10^T5,10^T6))","v":21330449131.465843},"pKa1 = logKpn",{"$f":"IF(VLOOKUP(K$2,Constantes!$B$23:$N$303,4)=\"\",\"\",VLOOKUP(K$2,Constantes!$B$23:$N$303,4))","v":-7},{"$f":"IF(VLOOKUP(L$2,Constantes!$B$23:$N$303,4)=\"\",\"\",VLOOKUP(L$2,Constantes!$B$23:$N$303,4))","v":6.3520000000000003},{"$f":"IF(VLOOKUP(M$2,Constantes!$B$23:$N$303,4)=\"\",\"\",VLOOKUP(M$2,Constantes!$B$23:$N$303,4))","v":4.7569999999999997},{"$f":"IF(VLOOKUP(N$2,Constantes!$B$23:$N$303,4)=\"\",\"\",VLOOKUP(N$2,Constantes!$B$23:$N$303,4))","v":1.2},{"$f":"IF(VLOOKUP(O$2,Constantes!$B$23:$N$303,4)=\"\",\"\",VLOOKUP(O$2,Constantes!$B$23:$N$303,4))","v":9.2439999999999998},{"$f":"IF(VLOOKUP(P$2,Constantes!$B$23:$N$303,4)=\"\",\"\",VLOOKUP(P$2,Constantes!$B$23:$N$303,4))","v":13.997},{"$f":"IF(VLOOKUP(Q$2,Constantes!$B$23:$N$303,4)=\"\",\"\",VLOOKUP(Q$2,Constantes!$B$23:$N$303,4))","v":4.43}]
["[H2B]",null,null,null,5.0000000000000002E-5,null,null,null,null,"pKa2","",10.329000000000001,"",7.7,"","","",null,null,10.329000000000001,"bp2",{"$f":"IF(K6=\"\",\"\",IF(K7=\"\",V5*10^K5,(IF(K8=\"\",V5*10^K6,(IF(K9=\"\",V5*10^K7,(IF(K10=\"\",V5*10^K8,V5*10^K9))))))))","v":""},4.7973344863669224E+16,"",794328234.7242825,"","","",{"$f":"IF(R6=\"\",\"\",AC5*10^R5)","v":""},{"$f":"IF(S6=\"\",\"\",AD5*10^S5)","v":""},{"$f":"IF(T6=\"\",\"\",AE5*10^T5)","v":4.7973344863669224E+16},"pKa2 = logKpn-1",{"$f":"IF(VLOOKUP(K$2,Constantes!$B$23:$N$303,5)=\"\",\"\",VLOOKUP(K$2,Constantes!$B$23:$N$303,5))","v":""},{"$f":"IF(VLOOKUP(L$2,Constantes!$B$23:$N$303,5)=\"\",\"\",VLOOKUP(L$2,Constantes!$B$23:$N$303,5))","v":10.329000000000001},{"$f":"IF(VLOOKUP(M$2,Constantes!$B$23:$N$303,5)=\"\",\"\",VLOOKUP(M$2,Constantes!$B$23:$N$303,5))","v":""},{"$f":"IF(VLOOKUP(N$2,Constantes!$B$23:$N$303,5)=\"\",\"\",VLOOKUP(N$2,Constantes!$B$23:$N$303,5))","v":7.7},{"$f":"IF(VLOOKUP(O$2,Constantes!$B$23:$N$303,5)=\"\",\"\",VLOOKUP(O$2,Constantes!$B$23:$N$303,5))","v":""},{"$f":"IF(VLOOKUP(P$2,Constantes!$B$23:$N$303,5)=\"\",\"\",VLOOKUP(P$2,Constantes!$B$23:$N$303,5))","v":""},{"$f":"IF(VLOOKUP(Q$2,Constantes!$B$23:$N$303,5)=\"\",\"\",VLOOKUP(Q$2,Constantes!$B$23:$N$303,5))","v":""}]
["[H3B]",null,null,null,null,null,null,null,null,"pKa3","","","","","","","",null,null,null,"bp3",{"$f":"IF(K7=\"\",\"\",IF(K8=\"\",V6*10^K5,(IF(K9=\"\",V6*10^K6,(IF(K10=\"\",V6*10^K7,V6*10^K8))))))","v":""},"","","","","","",null,null,null,"pKa3 = logKpn-2",{"$f":"IF(VLOOKUP(K$2,Constantes!$B$23:$N$303,6)=\"\",\"\",VLOOKUP(K$2,Constantes!$B$23:$N$303,6))","v":""},{"$f":"IF(VLOOKUP(L$2,Constantes!$B$23:$N$303,6)=\"\",\"\",VLOOKUP(L$2,Constantes!$B$23:$N$303,6))","v":""},{"$f":"IF(VLOOKUP(M$2,Constantes!$B$23:$N$303,6)=\"\",\"\",VLOOKUP(M$2,Constantes!$B$23:$N$303,6))","v":""},{"$f":"IF(VLOOKUP(N$2,Constantes!$B$23:$N$303,6)=\"\",\"\",VLOOKUP(N$2,Constantes!$B$23:$N$303,6))","v":""},{"$f":"IF(VLOOKUP(O$2,Constantes!$B$23:$N$303,6)=\"\",\"\",VLOOKUP(O$2,Constantes!$B$23:$N$303,6))","v":""},{"$f":"IF(VLOOKUP(P$2,Constantes!$B$23:$N$303,6)=\"\",\"\",VLOOKUP(P$2,Constantes!$B$23:$N$303,6))","v":""},{"$f":"IF(VLOOKUP(Q$2,Constantes!$B$23:$N$303,6)=\"\",\"\",VLOOKUP(Q$2,Constantes!$B$23:$N$303,6))","v":""}]
["[H4B]",null,null,null,null,null,null,null,"Total","pKa4","","","","","","","",null,null,null,"bp4",{"$f":"IF(K8=\"\",\"\",IF(K9=\"\",V7*10^K5,(IF(K10=\"\",V7*10^K6,V7*10^K7))))","v":""},"","","","","","",null,null,null,"pKa4 = logKpn-3",{"$f":"IF(VLOOKUP(K$2,Constantes!$B$23:$N$303,7)=\"\",\"\",VLOOKUP(K$2,Constantes!$B$23:$N$303,7))","v":""},{"$f":"IF(VLOOKUP(L$2,Constantes!$B$23:$N$303,7)=\"\",\"\",VLOOKUP(L$2,Constantes!$B$23:$N$303,7))","v":""},{"$f":"IF(VLOOKUP(M$2,Constantes!$B$23:$N$303,7)=\"\",\"\",VLOOKUP(M$2,Constantes!$B$23:$N$303,7))","v":""},{"$f":"IF(VLOOKUP(N$2,Constantes!$B$23:$N$303,7)=\"\",\"\",VLOOKUP(N$2,Constantes!$B$23:$N$303,7))","v":""},{"$f":"IF(VLOOKUP(O$2,Constantes!$B$23:$N$303,7)=\"\",\"\",VLOOKUP(O$2,Constantes!$B$23:$N$303,7))","v":""},{"$f":"IF(VLOOKUP(P$2,Constantes!$B$23:$N$303,7)=\"\",\"\",VLOOKUP(P$2,Constantes!$B$23:$N$303,7))","v":""},{"$f":"IF(VLOOKUP(Q$2,Constantes!$B$23:$N$303,7)=\"\",\"\",VLOOKUP(Q$2,Constantes!$B$23:$N$303,7))","v":""}]
["[H5B]",null,null,null,null,null,null,null,"Titulado(s) ","pKa5","","","","","","","",null,null,null,"bp5",{"$f":"IF(K9=\"\",\"\",IF(K10=\"\",V8*10^K5,V8*10^K6))","v":""},"","","","","","",null,null,null,"pKa5 = logKpn-4",{"$f":"IF(VLOOKUP(K$2,Constantes!$B$23:$N$303,8)=\"\",\"\",VLOOKUP(K$2,Constantes!$B$23:$N$303,8))","v":""},{"$f":"IF(VLOOKUP(L$2,Constantes!$B$23:$N$303,8)=\"\",\"\",VLOOKUP(L$2,Constantes!$B$23:$N$303,8))","v":""},{"$f":"IF(VLOOKUP(M$2,Constantes!$B$23:$N$303,8)=\"\",\"\",VLOOKUP(M$2,Constantes!$B$23:$N$303,8))","v":""},{"$f":"IF(VLOOKUP(N$2,Constantes!$B$23:$N$303,8)=\"\",\"\",VLOOKUP(N$2,Constantes!$B$23:$N$303,8))","v":""},{"$f":"IF(VLOOKUP(O$2,Constantes!$B$23:$N$303,8)=\"\",\"\",VLOOKUP(O$2,Constantes!$B$23:$N$303,8))","v":""},{"$f":"IF(VLOOKUP(P$2,Constantes!$B$23:$N$303,8)=\"\",\"\",VLOOKUP(P$2,Constantes!$B$23:$N$303,8))","v":""},{"$f":"IF(VLOOKUP(Q$2,Constantes!$B$23:$N$303,8)=\"\",\"\",VLOOKUP(Q$2,Constantes!$B$23:$N$303,8))","v":""}]
["[H6B]",null,null,null,null,null,null,null,"SS","pKa6","","","","","","","",null,null,null,"bp6",{"$f":"IF(K10=\"\",\"\",V9*10^K5)","v":""},"","","","","","",null,null,null,"pKa6 = logKpn-5",{"$f":"IF(VLOOKUP(K$2,Constantes!$B$23:$N$303,9)=\"\",\"\",VLOOKUP(K$2,Constantes!$B$23:$N$303,9))","v":""},{"$f":"IF(VLOOKUP(L$2,Constantes!$B$23:$N$303,9)=\"\",\"\",VLOOKUP(L$2,Constantes!$B$23:$N$303,9))","v":""},{"$f":"IF(VLOOKUP(M$2,Constantes!$B$23:$N$303,9)=\"\",\"\",VLOOKUP(M$2,Constantes!$B$23:$N$303,9))","v":""},{"$f":"IF(VLOOKUP(N$2,Constantes!$B$23:$N$303,9)=\"\",\"\",VLOOKUP(N$2,Constantes!$B$23:$N$303,9))","v":""},{"$f":"IF(VLOOKUP(O$2,Constantes!$B$23:$N$303,9)=\"\",\"\",VLOOKUP(O$2,Constantes!$B$23:$N$303,9))","v":""},{"$f":"IF(VLOOKUP(P$2,Constantes!$B$23:$N$303,9)=\"\",\"\",VLOOKUP(P$2,Constantes!$B$23:$N$303,9))","v":""},{"$f":"IF(VLOOKUP(Q$2,Constantes!$B$23:$N$303,9)=\"\",\"\",VLOOKUP(Q$2,Constantes!$B$23:$N$303,9))","v":""}]
["S[HiB]",{"$f":"SUM(B4:B10)","v":0},{"$f":"SUM(C4:C10)","v":0},0.1,5.0000000000000002E-5,0,0,0,{"$f":"SUM(B11:H11)","v":0.10005},"pKw",13.997,"    Observação: este titulador virtual calcula \"pH\", ou seja, ignora interações iônicas, que são consideradas nos módulos Simulador e pH",null,null,null,null,null,null,null,null,"Kw",{"$f":"10^-K11","v":1.0069316688518014E-14},null,null,null,null,null,null,null,null,null,"Indicador: pKa1 ou 2",{"$f":"IF(VLOOKUP(K$2,Constantes!$B$23:$R$303,14)=\"\",\"\",VLOOKUP(K$2,Constantes!$B$23:$R$303,14))","v":""},{"$f":"IF(VLOOKUP(L$2,Constantes!$B$23:$R$303,14)=\"\",\"\",VLOOKUP(L$2,Constantes!$B$23:$R$303,14))","v":""},{"$f":"IF(VLOOKUP(M$2,Constantes!$B$23:$R$303,14)=\"\",\"\",VLOOKUP(M$2,Constantes!$B$23:$R$303,14))","v":""},{"$f":"IF(VLOOKUP(N$2,Constantes!$B$23:$R$303,14)=\"\",\"\",VLOOKUP(N$2,Constantes!$B$23:$R$303,14))","v":7.7},{"$f":"IF(VLOOKUP(O$2,Constantes!$B$23:$R$303,14)=\"\",\"\",VLOOKUP(O$2,Constantes!$B$23:$R$303,14))","v":""},{"$f":"IF(VLOOKUP(P$2,Constantes!$B$23:$R$303,14)=\"\",\"\",VLOOKUP(P$2,Constantes!$B$23:$R$303,14))","v":""},{"$f":"IF(VLOOKUP(Q$2,Constantes!$B$23:$R$303,14)=\"\",\"\",VLOOKUP(Q$2,Constantes!$B$23:$R$303,14))","v":""}]
["S[H]",{"$f":"B5+2*B6+3*B7+4*B8+5*B9+6*B10","v":0},{"$f":"C5+2*C6+3*C7+4*C8+5*C9+6*C10","v":0},0.1,1E-4,0,0,0,{"$f":"SUM(B12:H12)","v":0.10010000000000001},null,null,null,null,"código de cores",null,null,null,null,null,null,null,null,null,null,null,null,null,null,null,null,null,"nº cor pH < pKa indic",{"$f":"IF(VLOOKUP(K$2,Constantes!$B$23:$R$303,15)=\"\",\"\",VLOOKUP(K$2,Constantes!$B$23:$R$303,15))","v":""},{"$f":"IF(VLOOKUP(L$2,Constantes!$B$23:$R$303,15)=\"\",\"\",VLOOKUP(L$2,Constantes!$B$23:$R$303,15))","v":""},{"$f":"IF(VLOOKUP(M$2,Constantes!$B$23:$R$303,15)=\"\",\"\",VLOOKUP(M$2,Constantes!$B$23:$R$303,15))","v":""},{"$f":"IF(VLOOKUP(N$2,Constantes!$B$23:$R$303,15)=\"\",\"\",VLOOKUP(N$2,Constantes!$B$23:$R$303,15))","v":4907000},{"$f":"IF(VLOOKUP(O$2,Constantes!$B$23:$R$303,15)=\"\",\"\",VLOOKUP(O$2,Constantes!$B$23:$R$303,15))","v":""},{"$f":"IF(VLOOKUP(P$2,Constantes!$B$23:$R$303,15)=\"\",\"\",VLOOKUP(P$2,Constantes!$B$23:$R$303,15))","v":""},{"$f":"IF(VLOOKUP(Q$2,Constantes!$B$23:$R$303,15)=\"\",\"\",VLOOKUP(Q$2,Constantes!$B$23:$R$303,15))","v":""}]
["TITULANTE",{"$f":"R3","v":"Ácido forte"},{"$f":"S3","v":"Base forte"},{"$f":"T3","v":"Ác. carbônico"},"Total"," Volume de titulado no béquer (mL)",null,null,null,null,null,null,null,"N ã o    a l t e r e  ",null,null,null,null,null,null,null,null,null,null,null,null,null,null,null,null,null,"nº cor pH = pKa indic",{"$f":"IF(VLOOKUP(K$2,Constantes!$B$23:$R$303,16)=\"\",\"\",VLOOKUP(K$2,Constantes!$B$23:$R$303,16))","v":""},{"$f":"IF(VLOOKUP(L$2,Constantes!$B$23:$R$303,16)=\"\",\"\",VLOOKUP(L$2,Constantes!$B$23:$R$303,16))","v":""},{"$f":"IF(VLOOKUP(M$2,Constantes!$B$23:$R$303,16)=\"\",\"\",VLOOKUP(M$2,Constantes!$B$23:$R$303,16))","v":""},{"$f":"IF(VLOOKUP(N$2,Constantes!$B$23:$R$303,16)=\"\",\"\",VLOOKUP(N$2,Constantes!$B$23:$R$303,16))","v":4961023},{"$f":"IF(VLOOKUP(O$2,Constantes!$B$23:$R$303,16)=\"\",\"\",VLOOKUP(O$2,Constantes!$B$23:$R$303,16))","v":""},{"$f":"IF(VLOOKUP(P$2,Constantes!$B$23:$R$303,16)=\"\",\"\",VLOOKUP(P$2,Constantes!$B$23:$R$303,16))","v":""},{"$f":"IF(VLOOKUP(Q$2,Constantes!$B$23:$R$303,16)=\"\",\"\",VLOOKUP(Q$2,Constantes!$B$23:$R$303,16))","v":""}]
["[B]",null,0.1,null,"Titulante(s) ","Amostra","Água","Titulado",null,"          Reservatório de titulante",null,null,null," M u d e   c r I t e r o s a m e n t e",null,null,null,null,null,null,null,null,null,null,null,null,null,null,null,null,null,"nº cor pH > pKa indic",{"$f":"IF(VLOOKUP(K$2,Constantes!$B$23:$R$303,17)=\"\",\"\",VLOOKUP(K$2,Constantes!$B$23:$R$303,17))","v":""},{"$f":"IF(VLOOKUP(L$2,Constantes!$B$23:$R$303,17)=\"\",\"\",VLOOKUP(L$2,Constantes!$B$23:$R$303,17))","v":""},{"$f":"IF(VLOOKUP(M$2,Constantes!$B$23:$R$303,17)=\"\",\"\",VLOOKUP(M$2,Constantes!$B$23:$R$303,17))","v":""},{"$f":"IF(VLOOKUP(N$2,Constantes!$B$23:$R$303,17)=\"\",\"\",VLOOKUP(N$2,Constantes!$B$23:$R$303,17))","v":5263615},{"$f":"IF(VLOOKUP(O$2,Constantes!$B$23:$R$303,17)=\"\",\"\",VLOOKUP(O$2,Constantes!$B$23:$R$303,17))","v":""},{"$f":"IF(VLOOKUP(P$2,Constantes!$B$23:$R$303,17)=\"\",\"\",VLOOKUP(P$2,Constantes!$B$23:$R$303,17))","v":""},{"$f":"IF(VLOOKUP(Q$2,Constantes!$B$23:$R$303,17)=\"\",\"\",VLOOKUP(Q$2,Constantes!$B$23:$R$303,17))","v":""}]
["[HB]",null,null,null,null,"pipetada","adicionada","(=vol. inicial)",null,"    Composição: células B13 a D16",null,null,null,"Preencha, altere ou deixe em branco"]
["[H2B]",null,null,null,"SS",20,0,{"$f":"F16+G16","v":20}]
["S[HiB]",{"$f":"SUM(B14:B16)","v":0},{"$f":"SUM(C14:C16)","v":0.1},{"$f":"SUM(D14:D16)","v":0},{"$f":"SUM(B17:D17)","v":0.1},"Capacidade da bureta motorizada"]
["S[H]",{"$f":"B15+2*B16","v":0},{"$f":"C15+2*C16","v":0},{"$f":"D15+2*D16","v":0},{"$f":"SUM(B18:D18)","v":0},50,null," mL de titulante                  ."]
["Amostra desconhecida"]
["BURETA digital","  motor",{"$f":"B21","v":27.420000000000009},null,null,null,"pH-metro"]
["Vol. adic., mL",27.420000000000009,"Seringa com Titulante",null,null,"\"pH\"  ",12.189821957144886]
[null,"Adição de titulante (mL)    "]
[]
[null,null,null,null,null,null,"Mostrar/ocultar"]
[null,null,null,null,null,true,"pH e curva de titulação"]
[null,null,null,null,null,true,"Espécies em equilíbrio"]
[]
["   Indicador ",null,null,null,null,null," Equilíbrio do TITULADO"]
["pKa, indicador",7.7,null,null,null,null,"Fração molar","Ácido acético"]
["Região","Cores",null,null,null,null,"% B",99.999996308711189]
["pH > pK+1",{"$f":"B29+1","v":8.6999999999999993},null,12.189821957144886,{"$f":"$D$31","v":12.189821957144886},null,"% HB",3.6912888157754149E-6]
["pH = pK",{"$f":"B29","v":7.7},null,{"$f":"$D$31","v":12.189821957144886},{"$f":"$D$31","v":12.189821957144886},null,"% H2B"]
["pH < pK-1",{"$f":"B29-1","v":6.7},null,{"$f":"$D$31","v":12.189821957144886},{"$f":"$D$31","v":12.189821957144886},null,"% H3B",null,null,null,null,null,null,null,null,null,null," Ler dados nas curvas"]
["  Equilíbrio do INDICADOR",null,null,{"$f":"$D$31","v":12.189821957144886},{"$f":"$D$31","v":12.189821957144886},null,"% H4B",null,null,null,null,null,null,null,null,null,null," Copiar e colar o gráfico"]
["Fração molar","Indicador",null,{"$f":"$D$31","v":12.189821957144886},{"$f":"$D$31","v":12.189821957144886},null,"% H5B",null,null,null,null,null,null,null,null,null,null," Mudar escalas"]
["% Ind",99.996762841353345,null,"   Agitador magnético",null,null,"% H6B",null,null,null,null,null,null,null,null,null,null," Gerar outros gráficos"]
["% Hind",3.2371586466517499E-3,null,null,null,null,null,null,null,null,null,null,null,null,null,null,null," Analisar os dados"]
[]
["V adic.","\"pH\"","V adic.","\"pH\"","[H]","CHtot =","      fatores de diluição",null,"h1","h2","h3","h4","h5","h6","h7","h1 titulante","h2 titulante","h3 titulante"]
[null,null,"no gráfico","no gráfico",null,"CHcalc","Titulado (amostra)","Titulante (bureta)",{"$f":"K3","v":"Ácido clorídrico"},"Ácido carbônico","Ácido acético","Vermelho de fenol (pKa 7,7)","Hidróxido de amônio","Hidróxido de sódio","o-Fenotidina","Ácido forte","Base forte","Ác. carbônico"]
[0,2.8732302361167967,0,2.8732302361167967,1.3389666617932572E-3,0.10009999999813043,1,0,null,null,0.9870999507950482,1.020765315764889,null,null,null,null,0.99999999999986566]
[1,3.5031801597215235,1,3.5031801597215235,3.1392061771354723E-4,9.5333333331324904E-2,0.95238095238095233,4.7619047619047616E-2,null,null,0.94720139027253503,1.0048871214901245,null,null,null,null,0.99999999999942701]
[2,3.8085675346665084,2,3.8085675346665084,1.5539336285957283E-4,9.1000000009423987E-2,0.90909090909090906,9.0909090909090912E-2,null,null,0.8987895096309122,1.0023283847338127,null,null,null,null,0.99999999999884237]
[3,4.0058326744474471,3,4.0058326744474471,9.8665955390817055E-5,8.7043478246189368E-2,0.86956521739130432,0.13043478260869565,null,null,0.84936466295638247,1.0013591258377519,null,null,null,null,0.99999999999817679]
[4,4.1558583942241967,4,4.1558583942241967,6.9846010640012724E-5,8.341666665964223E-2,0.83333333333333337,0.16666666666666666,null,null,0.79966143943113877,1.0008201765518951,null,null,null,null,0.9999999999974245]
[5,4.280239702668041,5,4.280239702668041,5.2451788015166761E-5,8.0080000009744745E-2,0.8,0.2,null,null,0.74984412999152317,1.0004503598216523,null,null,null,null,0.99999999999657041]
[6,4.3890868783928454,6,4.3890868783928454,4.0823771229455128E-5,7.6999999969965732E-2,0.76923076923076927,0.23076923076923078,null,null,0.69996921475020357,1.0001580835029342,null,null,null,null,0.99999999999559352]
[7,4.4880378074012697,7,4.4880378074012697,3.2505899822105317E-5,7.4148148172929709E-2,0.7407407407407407,0.25925925925925924,null,null,0.65006122413050615,0.99990147958571751,null,null,null,null,0.99999999999446598]
[8,4.5806689499877393,8,4.5806689499877393,2.6262196712177228E-5,7.1500000010245868E-2,0.7142857142857143,0.2857142857142857,null,null,0.60013250631745496,0.99965688434123023,null,null,null,null,0.99999999999315037]
[9,4.6695164958946407,9,4.6695164958946407,2.1403436281252077E-5,6.9034482779161035E-2,0.68965517241379315,0.31034482758620691,null,null,0.55018995341741583,0.99940775872548016,null,null,null,null,0.99999999999159539]
[10,4.756587051320821,10,4.756587051320821,1.7515113207079535E-5,6.6733333331724376E-2,0.66666666666666663,0.33333333333333331,null,null,0.50023771208224632,0.99913964865144611,null,null,null,null,0.99999999998972966]
[11,4.8436616347171366,11,4.8436616347171366,1.4333041729391235E-5,6.4580645138225964E-2,0.64516129032258063,0.35483870967741937,null,null,0.45027842990456374,0.99883697481571276,null,null,null,null,0.99999999998744948]
[12,4.9325233497656882,12,4.9325233497656882,1.1680909259718396E-5,6.2562499980916828E-2,0.625,0.375,null,null,0.40031387901426657,0.99847986839702274,null,null,null,null,0.99999999998459987]
[13,5.0251862998120487,13,5.0251862998120487,9.4365598823608279E-6,6.0666666669311482E-2,0.60606060606060608,0.39393939393939392,null,null,0.35034529462329556,0.99803960179123974,null,null,null,null,0.99999999998093725]
[14,5.1242044870741665,14,5.1242044870741665,7.5126907651767135E-6,5.8882352934952836E-2,0.58823529411764708,0.41176470588235292,null,null,0.30037357183718771,0.99747023226013765,null,null,null,null,0.9999999999760556]
[15,5.2331966585479677,15,5.2331966585479677,5.8452533766643153E-6,5.72000000015997E-2,0.5714285714285714,0.42857142857142855,null,null,0.25039939287866958,0.99669076910609433,null,null,null,null,0.99999999996922506]
[16,5.357911869417876,16,5.357911869417876,4.3861969703454432E-6,5.5611111120401228E-2,0.55555555555555558,0.44444444444444442,null,null,0.20042331940066108,0.99554115221811934,null,null,null,null,0.99999999995898792]
[17,5.508810659404844,17,5.508810659404844,3.0987699842896601E-6,5.4108108108327897E-2,0.54054054054054057,0.45945945945945948,null,null,0.1504459072151117,0.99365141692549186,null,null,null,null,0.99999999994194888]
[18,5.7089888504706323,18,5.7089888504706323,1.9543896296683889E-6,5.2684210534268701E-2,0.52631578947368418,0.47368421052631576,null,null,0.1004680022162532,0.98992501123208043,null,null,null,null,0.9999999999079574]
[18.2,5.7592991502024233,18.2,5.7592991502024233,1.7406074972009144E-6,5.2408376954916187E-2,0.52356020942408377,0.47643979057591618,null,null,9.0472517586448517E-2,0.98869447152829648,null,null,null,null,0.99999999989665267]
[18.399999999999999,5.8148899949155748,18.399999999999999,5.8148899949155748,1.5314753292357401E-6,5.213541667027468E-2,0.52083333333333337,0.47916666666666663,null,null,8.0477140361451233E-2,0.9871634557157235,null,null,null,null,0.99999999988253996]
[18.599999999999998,5.8771800133399665,18.599999999999998,5.8771800133399665,1.3268443720046404E-6,5.1865284976785997E-2,0.5181347150259068,0.48186528497409326,null,null,7.0481935471079254E-2,0.98520615347382434,null,null,null,null,0.99999999986442489]
[18.799999999999997,5.9482406689785421,18.799999999999997,5.9482406689785421,1.1265729805747349E-6,5.1597938146184984E-2,0.51546391752577325,0.48453608247422675,null,null,6.0487010485088415E-2,0.9826151649533813,null,null,null,null,0.99999999984032362]
[18.999999999999996,6.0312710306607187,18.999999999999996,6.0312710306607187,9.3052697917589026E-7,5.1333333334999259E-2,0.51282051282051277,0.48717948717948711,null,null,5.0492554662420003E-2,0.97902257773817947,null,null,null,null,0.99999999980668253]
[19.199999999999996,6.1316018304787576,19.199999999999996,6.1316018304787576,7.3858106511831614E-7,5.1071428572897058E-2,0.51020408163265307,0.48979591836734687,null,null,4.04989375390052E-2,0.97370749579312232,null,null,null,null,0.99999999975644227]
[19.399999999999995,6.2591452705673873,19.399999999999995,6.2591452705673873,5.5062348323026625E-7,5.0812182741425516E-2,0.50761421319796962,0.49238578680203043,null,null,3.0506993567599252E-2,0.96503945795029644,null,null,null,null,0.99999999967330289]
[19.599999999999994,6.43583780573681,19.599999999999994,6.43583780573681,3.6657445221498949E-7,5.0555555554926482E-2,0.50505050505050508,0.49494949494949486,null,null,2.0519093400629764E-2,0.94838554712594336,null,null,null,null,0.99999999950927543]
[19.799999999999994,6.729320949409157,19.799999999999994,6.729320949409157,1.8650009209008174E-7,5.0301507537237923E-2,0.50251256281407042,0.49748743718592953,null,null,1.0545685051076175E-2,0.90335792576678775,null,null,null,null,0.99999999903545844]
[19.899999999999995,7.0075858007185161,19.899999999999995,7.0075858007185161,9.8268471123388591E-8,5.0175438596577096E-2,0.50125313283208028,0.49874686716791977,null,null,5.5844717348101048E-3,0.83122771468133938,null,null,null,null,0.9999999981694323]
[19.949999999999996,7.2593171945773065,19.949999999999996,7.2593171945773065,5.5040555123704652E-8,5.011264080124405E-2,0.50062578222778475,0.49937421777221519,null,null,3.1355873101927977E-3,0.73394163569063808,null,null,null,null,0.99999999673173556]
[19.969999999999995,7.4183593583293259,19.969999999999995,7.4183593583293259,3.8162836057532731E-8,5.0087565674162324E-2,0.50037528146109589,0.49962471853890406,null,null,2.1761784687832552E-3,0.65667324273625094,null,null,null,null,0.99999999528632799]
[19.979999999999997,7.524222097825259,19.979999999999997,7.524222097825259,2.9907347862569245E-8,5.0075037518871948E-2,0.5002501250625313,0.4997498749374687,null,null,1.7062248611958595E-3,0.5998272184513388,null,null,null,null,0.99999999398518746]
[19.989999999999998,7.6604494755156338,19.989999999999998,7.6604494755156338,2.1854985590452048E-8,5.0062515628844777E-2,0.50012503125781449,0.49987496874218557,null,null,1.2474077660741239E-3,0.52275165743186436,null,null,null,null,0.99999999176905929]
[20,7.8499296265654266,20,7.8499296265654266,1.4127664519123931E-8,5.0050000000012092E-2,0.5,0.5,null,null,8.0671453297832742E-4,0.41454079497715701,null,null,null,null,0.99999998726703276]
[20.010000000000002,8.1557883764617145,20.010000000000002,8.1557883764617145,6.9857272251276364E-9,5.0037490627351772E-2,0.4998750312421894,0.50012496875781054,null,null,3.9906007498708736E-4,0.25932280484053238,null,null,null,null,0.99999997424933995]
[20.020000000000003,8.8002537922002375,20.020000000000003,8.8002537922002375,1.5839672860960506E-9,5.0024987506237795E-2,0.49975012493753118,0.50024987506246876,null,null,9.0512153230576858E-5,7.3547731050991369E-2,null,null,null,null,0.99999988643258431]
[20.030000000000005,9.420395974535495,20.030000000000005,9.420395974535495,3.7984291089246862E-10,5.0012490631989065E-2,0.49962528103922055,0.50037471896077956,null,null,2.1706739670579962E-5,1.868159592111035E-2,null,null,null,null,0.99999952641736534]
[20.040000000000006,9.7021594396792352,20.040000000000006,9.7021594396792352,1.9853659092078828E-10,5.0000000000021964E-2,0.49950049950049941,0.50049950049950054,null,null,1.1345813314114336E-5,9.8523655675628093E-3,null,null,null,null,0.99999909393564435]
[20.050000000000008,9.8742924151010811,20.050000000000008,9.8742924151010811,1.3356958754497338E-10,4.9987515605435601E-2,0.49937578027465651,0.50062421972534332,null,null,7.6331583053675139E-6,6.6498210842489544E-3,null,null,null,null,0.99999865323497106]
[20.070000000000007,10.093909964431077,20.070000000000007,10.093909964431077,8.055454251838112E-11,4.9962565510276759E-2,0.49912652857499368,0.50087347142500638,null,null,4.6034988163781206E-6,4.0210566628661373E-3,null,null,null,null,0.99999776689576558]
[20.120000000000008,10.393538483884186,20.120000000000008,10.393538483884186,4.0407456690257009E-11,4.9900299102705423E-2,0.49850448654037882,0.50149551345962129,null,null,2.3091944961570062E-6,2.0210771233604564E-3,null,null,null,null,0.99999554819072445]
[20.22000000000001,10.69327039225027,20.22000000000001,10.69327039225027,2.0264206748144207E-11,4.9776230731138439E-2,0.49726504226752843,0.50273495773247145,null,null,1.1580547847158894E-6,1.0145857442253529E-3,null,null,null,null,0.99999112299352766]
[20.320000000000011,10.868242140393704,20.320000000000011,10.868242140393704,1.3544340386362466E-11,4.9652777778264857E-2,0.49603174603174593,0.50396825396825418,null,null,7.7402951956958683E-7,6.7836455911836075E-4,null,null,null,null,0.99998671882889256]
[20.52000000000001,11.08791950950399,20.52000000000001,11.08791950950399,8.167337276710176E-12,4.9407699900255488E-2,0.49358341559723579,0.50641658440276416,null,null,4.6674565886129713E-7,4.0916902942315052E-4,null,null,null,null,0.99997797530288601]
[20.72000000000001,11.231901653576642,20.72000000000001,11.231901653576642,5.8627091112216304E-12,4.9165029466246242E-2,0.49115913555992124,0.5088408644400787,null,null,3.3504118839659208E-7,2.9374518425413109E-4,null,null,null,null,0.99996931767056185]
[20.920000000000009,11.338914064224809,20.920000000000009,11.338914064224809,4.5823255025117737E-12,4.8924731186500869E-2,0.48875855327468221,0.51124144672531779,null,null,2.6187004480106103E-7,2.296075727528938E-4,null,null,null,null,0.9999607448162029]
[21.420000000000009,11.525518441107124,21.420000000000009,11.525518441107124,2.9818209305059202E-12,4.8334138103420056E-2,0.48285852245292121,0.51714147754707884,null,null,1.7040466716147281E-7,1.4942272801924997E-4,null,null,null,null,0.99993967570690845]
[22.420000000000009,11.749231280293316,22.420000000000009,11.749231280293316,1.7814298276019139E-12,4.7194719483943957E-2,0.47147571900047136,0.52852428099952864,null,null,1.0180489866537342E-7,8.9275018080023347E-5,null,null,null,null,0.99989903114591461]
[23.420000000000009,11.890371141489595,23.420000000000009,11.890371141489595,1.2871491034088324E-12,4.6107784445015225E-2,0.46061722708429287,0.53938277291570713,null,null,7.355781614906738E-8,6.4506108605654183E-5,null,null,null,null,0.99986026331058531]
[24.420000000000009,11.992448039818555,24.420000000000009,11.992448039818555,1.0175411003026713E-12,4.5069788383471379E-2,0.45024763619990987,0.54975236380009018,null,null,5.8150296632048848E-8,5.0995260214053378E-5,null,null,null,null,0.99982324517826215]
[25.420000000000009,12.071712827775627,25.420000000000009,12.071712827775627,8.4778781877078152E-13,4.4077498895910699E-2,0.44033465433729624,0.55966534566270376,null,null,4.8449260286534798E-8,4.2488237787790276E-5,null,null,null,null,0.99978786091679894]
[26.420000000000009,12.136033669579774,26.420000000000009,12.136033669579774,7.3108240260788229E-13,4.3127962073610679E-2,0.43084877208099948,0.56915122791900052,null,null,4.1779795683365845E-8,3.6639574145641809E-5,null,null,null,null,0.99975400469265319]
[27.420000000000009,12.189821957144886,27.420000000000009,12.189821957144886,6.4591897494691862E-13,4.2218473189301615E-2,0.42176296921130318,0.57823703078869682,null,null,3.6912888118175236E-8,3.2371586432520991E-5,null,null,null,null,0.99972157961842223]

{"sheet":"Simulador","index":4,"n_rows":91,"n_cols":78,"rows_kept":91,"cut":false,"hidden":false,"merged":[]}
[null,"             Titulador Virtual  – Simulador de curvas",null,null,null,null,null,"<--- leia instruções",null,null,"  pKa dos ácidos e bases em solução",null,null,"Clique em K2 a Q2; selecione ácidos/bases; clique em J2; leia M1",null,null,null,null,null,null,"     Constantes cumulativas de protonação = bp = PKp (calculado pela planilha)",null,null,null,null,null,"  pKa(n) = -log Kd(HB-->B) = log Kp(1)",null,null,null,null,"       pKas dos ácidos HiB, carregados da planilha Constantes "]
["   Composição da amostra hipotética (titulado) e do titulante (concentrações em mol/L)",null,null,null,null,null,null,null,null,null,5,6,59,1,7,4,2,null,"Titulante",null,null,"Titulado",null,null,null,null,null,null,"Titulante",null,null,null,"    Titulado","Clique em J2 para usar estes pKas na simulação"]
["AMOSTRA Espécie",{"$f":"K3","v":"Ácido EDTA"},{"$f":"L3","v":"Ácido fosfórico"},"Ácido l-glutâmico","Ácido acético","Hidróxido de amônio","Ácido clorídrico","Ácido carbônico",null,"Ácido / Base","Ácido EDTA","Ácido fosfórico","Ácido l-glutâmico","Ácido acético","Hidróxido de amônio","Ácido clorídrico","Ácido carbônico","Ácido forte","Base forte","Ác. carbônico","Ácido / Base",{"$f":"IF(K3=\"\",\"\",K3)","v":"Ácido EDTA"},"Ácido fosfórico","Ácido l-glutâmico","Ácido acético","Hidróxido de amônio","Ácido clorídrico","Ácido carbônico",{"$f":"R3","v":"Ácido forte"},{"$f":"S3","v":"Base forte"},{"$f":"T3","v":"Ác. carbônico"},"Ácido / Base",{"$f":"IF(VLOOKUP(K$2,Constantes!$B$23:$N$303,2)=\"\",\"\",VLOOKUP(K$2,Constantes!$B$23:$N$303,2))","v":"Ácido EDTA"},{"$f":"IF(VLOOKUP(L$2,Constantes!$B$23:$N$303,2)=\"\",\"\",VLOOKUP(L$2,Constantes!$B$23:$N$303,2))","v":"Ácido fosfórico"},{"$f":"IF(VLOOKUP(M$2,Constantes!$B$23:$N$303,2)=\"\",\"\",VLOOKUP(M$2,Constantes!$B$23:$N$303,2))","v":"Ácido l-glutâmico"},{"$f":"IF(VLOOKUP(N$2,Constantes!$B$23:$N$303,2)=\"\",\"\",VLOOKUP(N$2,Constantes!$B$23:$N$303,2))","v":"Ácido acético"},{"$f":"IF(VLOOKUP(O$2,Constantes!$B$23:$N$303,2)=\"\",\"\",VLOOKUP(O$2,Constantes!$B$23:$N$303,2))","v":"Hidróxido de amônio"},{"$f":"IF(VLOOKUP(P$2,Constantes!$B$23:$N$303,2)=\"\",\"\",VLOOKUP(P$2,Constantes!$B$23:$N$303,2))","v":"Ácido clorídrico"},{"$f":"IF(VLOOKUP(Q$2,Constantes!$B$23:$N$303,2)=\"\",\"\",VLOOKUP(Q$2,Constantes!$B$23:$N$303,2))","v":"Ácido carbônico"}]
["[B]",null,null,null,null,null,null,null,null,"Carga de B",-4,-3,-2,-1,0,-1,-2,-1,-1,-2,"Carga de B",-4,{"$f":"IF(L4=\"\",\"\",L4)","v":-3},-2,-1,0,-1,-2,{"$f":"IF(R4=\"\",\"\",R4)","v":-1},{"$f":"IF(S4=\"\",\"\",S4)","v":-1},{"$f":"IF(T4=\"\",\"\",T4)","v":-2},"Carga de B",{"$f":"IF(VLOOKUP(K$2,Constantes!$B$23:$N$303,3)=\"\",\"\",VLOOKUP(K$2,Constantes!$B$23:$N$303,3))","v":-4},{"$f":"IF(VLOOKUP(L$2,Constantes!$B$23:$N$303,3)=\"\",\"\",VLOOKUP(L$2,Constantes!$B$23:$N$303,3))","v":-3},{"$f":"IF(VLOOKUP(M$2,Constantes!$B$23:$N$303,3)=\"\",\"\",VLOOKUP(M$2,Constantes!$B$23:$N$303,3))","v":-2},{"$f":"IF(VLOOKUP(N$2,Constantes!$B$23:$N$303,3)=\"\",\"\",VLOOKUP(N$2,Constantes!$B$23:$N$303,3))","v":-1},{"$f":"IF(VLOOKUP(O$2,Constantes!$B$23:$N$303,3)=\"\",\"\",VLOOKUP(O$2,Constantes!$B$23:$N$303,3))","v":0},{"$f":"IF(VLOOKUP(P$2,Constantes!$B$23:$N$303,3)=\"\",\"\",VLOOKUP(P$2,Constantes!$B$23:$N$303,3))","v":-1},{"$f":"IF(VLOOKUP(Q$2,Constantes!$B$23:$N$303,3)=\"\",\"\",VLOOKUP(Q$2,Constantes!$B$23:$N$303,3))","v":-2}]
["[HB]",null,null,null,null,null,null,null,null,"pKa1",-0.21,2.1480000000000001,2.23,4.7569999999999997,9.2439999999999998,-7,6.3520000000000003,-6,13.997,6.3520000000000003,"bp1",{"$f":"IF(K5=\"\",\"\",IF(K6=\"\",10^K5,(IF(K7=\"\",10^K6,(IF(K8=\"\",10^K7,(IF(K9=\"\",10^K8,(IF(K10=\"\",10^K9,10^K10))))))))))","v":107151930523.76077},2238721138568.3457,8912509381.3374634,57147.863667186728,1753880501.8417609,9.9999999999999995E-8,21330449131.465843,{"$f":"IF(R5=\"\",\"\",IF(R6=\"\",10^R5,10^R6))","v":9.9999999999999995E-7},{"$f":"IF(S5=\"\",\"\",IF(S6=\"\",10^S5,10^S6))","v":99311604842093.641},{"$f":"IF(T5=\"\",\"\",IF(T6=\"\",10^T5,10^T6))","v":21330449131.465843},"pKa1 = logKpn",{"$f":"IF(VLOOKUP(K$2,Constantes!$B$23:$N$303,4)=\"\",\"\",VLOOKUP(K$2,Constantes!$B$23:$N$303,4))","v":-0.21},{"$f":"IF(VLOOKUP(L$2,Constantes!$B$23:$N$303,4)=\"\",\"\",VLOOKUP(L$2,Constantes!$B$23:$N$303,4))","v":2.1480000000000001},{"$f":"IF(VLOOKUP(M$2,Constantes!$B$23:$N$303,4)=\"\",\"\",VLOOKUP(M$2,Constantes!$B$23:$N$303,4))","v":2.23},{"$f":"IF(VLOOKUP(N$2,Constantes!$B$23:$N$303,4)=\"\",\"\",VLOOKUP(N$2,Constantes!$B$23:$N$303,4))","v":4.7569999999999997},{"$f":"IF(VLOOKUP(O$2,Constantes!$B$23:$N$303,4)=\"\",\"\",VLOOKUP(O$2,Constantes!$B$23:$N$303,4))","v":9.2439999999999998},{"$f":"IF(VLOOKUP(P$2,Constantes!$B$23:$N$303,4)=\"\",\"\",VLOOKUP(P$2,Constantes!$B$23:$N$303,4))","v":-7},{"$f":"IF(VLOOKUP(Q$2,Constantes!$B$23:$N$303,4)=\"\",\"\",VLOOKUP(Q$2,Constantes!$B$23:$N$303,4))","v":6.3520000000000003}]
["[H2B]",null,null,null,null,null,null,null,null,"pKa2",1.5,7.1989999999999998,4.42,"","","",10.329000000000001,null,null,10.329000000000001,"bp2",{"$f":"IF(K6=\"\",\"\",IF(K7=\"\",V5*10^K5,(IF(K8=\"\",V5*10^K6,(IF(K9=\"\",V5*10^K7,(IF(K10=\"\",V5*10^K8,V5*10^K9))))))))","v":6.0255958607435917E+17},3.539973410834362E+19,234422881531992.5,"","","",4.7973344863669224E+16,{"$f":"IF(R6=\"\",\"\",AC5*10^R5)","v":""},{"$f":"IF(S6=\"\",\"\",AD5*10^S5)","v":""},{"$f":"IF(T6=\"\",\"\",AE5*10^T5)","v":4.7973344863669224E+16},"pKa2 = logKpn-1",{"$f":"IF(VLOOKUP(K$2,Constantes!$B$23:$N$303,5)=\"\",\"\",VLOOKUP(K$2,Constantes!$B$23:$N$303,5))","v":1.5},{"$f":"IF(VLOOKUP(L$2,Constantes!$B$23:$N$303,5)=\"\",\"\",VLOOKUP(L$2,Constantes!$B$23:$N$303,5))","v":7.1989999999999998},{"$f":"IF(VLOOKUP(M$2,Constantes!$B$23:$N$303,5)=\"\",\"\",VLOOKUP(M$2,Constantes!$B$23:$N$303,5))","v":4.42},{"$f":"IF(VLOOKUP(N$2,Constantes!$B$23:$N$303,5)=\"\",\"\",VLOOKUP(N$2,Constantes!$B$23:$N$303,5))","v":""},{"$f":"IF(VLOOKUP(O$2,Constantes!$B$23:$N$303,5)=\"\",\"\",VLOOKUP(O$2,Constantes!$B$23:$N$303,5))","v":""},{"$f":"IF(VLOOKUP(P$2,Constantes!$B$23:$N$303,5)=\"\",\"\",VLOOKUP(P$2,Constantes!$B$23:$N$303,5))","v":""},{"$f":"IF(VLOOKUP(Q$2,Constantes!$B$23:$N$303,5)=\"\",\"\",VLOOKUP(Q$2,Constantes!$B$23:$N$303,5))","v":10.329000000000001}]
["[H3B]",null,0.05,null,null,null,null,null,null,"pKa3",2.21,12.35,9.9499999999999993,"","","","",null,null,null,"bp3",{"$f":"IF(K7=\"\",\"\",IF(K8=\"\",V6*10^K5,(IF(K9=\"\",V6*10^K6,(IF(K10=\"\",V6*10^K7,V6*10^K8))))))","v":7.7624711662869401E+20},4.9773708497893867E+21,3.9810717055349776E+16,"","","","",null,null,null,"pKa3 = logKpn-2",{"$f":"IF(VLOOKUP(K$2,Constantes!$B$23:$N$303,6)=\"\",\"\",VLOOKUP(K$2,Constantes!$B$23:$N$303,6))","v":2.21},{"$f":"IF(VLOOKUP(L$2,Constantes!$B$23:$N$303,6)=\"\",\"\",VLOOKUP(L$2,Constantes!$B$23:$N$303,6))","v":12.35},{"$f":"IF(VLOOKUP(M$2,Constantes!$B$23:$N$303,6)=\"\",\"\",VLOOKUP(M$2,Constantes!$B$23:$N$303,6))","v":9.9499999999999993},{"$f":"IF(VLOOKUP(N$2,Constantes!$B$23:$N$303,6)=\"\",\"\",VLOOKUP(N$2,Constantes!$B$23:$N$303,6))","v":""},{"$f":"IF(VLOOKUP(O$2,Constantes!$B$23:$N$303,6)=\"\",\"\",VLOOKUP(O$2,Constantes!$B$23:$N$303,6))","v":""},{"$f":"IF(VLOOKUP(P$2,Constantes!$B$23:$N$303,6)=\"\",\"\",VLOOKUP(P$2,Constantes!$B$23:$N$303,6))","v":""},{"$f":"IF(VLOOKUP(Q$2,Constantes!$B$23:$N$303,6)=\"\",\"\",VLOOKUP(Q$2,Constantes!$B$23:$N$303,6))","v":""}]
["[H4B]",null,null,null,null,null,null,null,null,"pKa4",3.11,"","","","","","",null,null,null,"bp4",{"$f":"IF(K8=\"\",\"\",IF(K9=\"\",V7*10^K5,(IF(K10=\"\",V7*10^K6,V7*10^K7))))","v":1.2589254117941712E+23},"","","","","","",null,null,null,"pKa4 = logKpn-3",{"$f":"IF(VLOOKUP(K$2,Constantes!$B$23:$N$303,7)=\"\",\"\",VLOOKUP(K$2,Constantes!$B$23:$N$303,7))","v":3.11},{"$f":"IF(VLOOKUP(L$2,Constantes!$B$23:$N$303,7)=\"\",\"\",VLOOKUP(L$2,Constantes!$B$23:$N$303,7))","v":""},{"$f":"IF(VLOOKUP(M$2,Constantes!$B$23:$N$303,7)=\"\",\"\",VLOOKUP(M$2,Constantes!$B$23:$N$303,7))","v":""},{"$f":"IF(VLOOKUP(N$2,Constantes!$B$23:$N$303,7)=\"\",\"\",VLOOKUP(N$2,Constantes!$B$23:$N$303,7))","v":""},{"$f":"IF(VLOOKUP(O$2,Constantes!$B$23:$N$303,7)=\"\",\"\",VLOOKUP(O$2,Constantes!$B$23:$N$303,7))","v":""},{"$f":"IF(VLOOKUP(P$2,Constantes!$B$23:$N$303,7)=\"\",\"\",VLOOKUP(P$2,Constantes!$B$23:$N$303,7))","v":""},{"$f":"IF(VLOOKUP(Q$2,Constantes!$B$23:$N$303,7)=\"\",\"\",VLOOKUP(Q$2,Constantes!$B$23:$N$303,7))","v":""}]
["[H5B]",null,null,null,null,null,null,null,"Total","pKa5",6.75,"","","","","","",null,null,null,"bp5",{"$f":"IF(K9=\"\",\"\",IF(K10=\"\",V8*10^K5,V8*10^K6))","v":3.9810717055349867E+24},"","","","","","",null,null,null,"pKa5 = logKpn-4",{"$f":"IF(VLOOKUP(K$2,Constantes!$B$23:$N$303,8)=\"\",\"\",VLOOKUP(K$2,Constantes!$B$23:$N$303,8))","v":6.75},{"$f":"IF(VLOOKUP(L$2,Constantes!$B$23:$N$303,8)=\"\",\"\",VLOOKUP(L$2,Constantes!$B$23:$N$303,8))","v":""},{"$f":"IF(VLOOKUP(M$2,Constantes!$B$23:$N$303,8)=\"\",\"\",VLOOKUP(M$2,Constantes!$B$23:$N$303,8))","v":""},{"$f":"IF(VLOOKUP(N$2,Constantes!$B$23:$N$303,8)=\"\",\"\",VLOOKUP(N$2,Constantes!$B$23:$N$303,8))","v":""},{"$f":"IF(VLOOKUP(O$2,Constantes!$B$23:$N$303,8)=\"\",\"\",VLOOKUP(O$2,Constantes!$B$23:$N$303,8))","v":""},{"$f":"IF(VLOOKUP(P$2,Constantes!$B$23:$N$303,8)=\"\",\"\",VLOOKUP(P$2,Constantes!$B$23:$N$303,8))","v":""},{"$f":"IF(VLOOKUP(Q$2,Constantes!$B$23:$N$303,8)=\"\",\"\",VLOOKUP(Q$2,Constantes!$B$23:$N$303,8))","v":""}]
["[H6B]",null,null,null,null,null,null,null,"SS","pKa6",11.03,"","","","","","",null,null,null,"bp6",{"$f":"IF(K10=\"\",\"\",V9*10^K5)","v":2.4547089156850394E+24},"","","","","","",null,null,null,"pKa6 = logKpn-5",{"$f":"IF(VLOOKUP(K$2,Constantes!$B$23:$N$303,9)=\"\",\"\",VLOOKUP(K$2,Constantes!$B$23:$N$303,9))","v":11.03},{"$f":"IF(VLOOKUP(L$2,Constantes!$B$23:$N$303,9)=\"\",\"\",VLOOKUP(L$2,Constantes!$B$23:$N$303,9))","v":""},{"$f":"IF(VLOOKUP(M$2,Constantes!$B$23:$N$303,9)=\"\",\"\",VLOOKUP(M$2,Constantes!$B$23:$N$303,9))","v":""},{"$f":"IF(VLOOKUP(N$2,Constantes!$B$23:$N$303,9)=\"\",\"\",VLOOKUP(N$2,Constantes!$B$23:$N$303,9))","v":""},{"$f":"IF(VLOOKUP(O$2,Constantes!$B$23:$N$303,9)=\"\",\"\",VLOOKUP(O$2,Constantes!$B$23:$N$303,9))","v":""},{"$f":"IF(VLOOKUP(P$2,Constantes!$B$23:$N$303,9)=\"\",\"\",VLOOKUP(P$2,Constantes!$B$23:$N$303,9))","v":""},{"$f":"IF(VLOOKUP(Q$2,Constantes!$B$23:$N$303,9)=\"\",\"\",VLOOKUP(Q$2,Constantes!$B$23:$N$303,9))","v":""}]
["S[HiB]",{"$f":"SUM(B4:B10)","v":0},{"$f":"SUM(C4:C10)","v":0.05},0,0,0,0,0,{"$f":"SUM(B11:H11)","v":0.05},"pKw",13.997,null,null,null,null,null,null,null,null,null,"Kw",{"$f":"10^-K11","v":1.0069316688518014E-14}]
["S[H]",{"$f":"B5+2*B6+3*B7+4*B8+5*B9+6*B10","v":0},{"$f":"C5+2*C6+3*C7+4*C8+5*C9+6*C10","v":0.15000000000000002},0,0,0,0,0,{"$f":"SUM(B12:H12)","v":0.15000000000000002}]
["SziCi",{"$f":"K4*B4+(K4+1)*B5+(K4+2)*B6+(K4+3)*B7+(K4+4)*B8+(K4+5)*B9+(K4+6)*B10","v":0},{"$f":"L4*C4+(L4+1)*C5+(L4+2)*C6+(L4+3)*C7+(L4+4)*C8+(L4+5)*C9+(L4+6)*C10","v":0},0,0,0,0,0,{"$f":"SUM(B13:H13)","v":0}]
["TITULANTE",{"$f":"R3","v":"Ácido forte"},{"$f":"S3","v":"Base forte"},{"$f":"T3","v":"Ác. carbônico"},"Total de "," Volume de titulado (amostra) (mL)",null,null," Contra-íons e outros íons",null,{"$f":"IF(K17<>K16, \"erro: K16><K17\",\"\")","v":""},{"$f":"IF(K20<>K19, \"erro: K19><K20\",\"\")","v":""},"              Simulação de",null," Parâmetros da eq. de Davies"]
["[B]",null,0.1,null,"Titulante(s) ","Amostra","Água","Titulado","    Titulado ","Mínimo  (mol/L)","Adicional  (mol/L)","Soma  (mol/L)","         dispersão de dados",null," para estimar coefic. de atividade"]
["[HB]",null,null,null,null,"pipetado","adicionada","(Vol inicial)","Cátions (monov.)",{"$f":"IF(I13<0,-I13,0)","v":0},0,{"$f":"J16+K16","v":0},"S pH=",0,"A ",0.50900000000000001]
["[H2B]",null,null,null,"SS",20,0,{"$f":"F17+G17","v":20},"Ânions (monov.)",{"$f":"IF(I13>0,I13,0)","v":0},0,{"$f":"J17+K17","v":0},"S Vol=",0,"b",0.3]
["S[HiB]",{"$f":"SUM(B15:B17)","v":0},{"$f":"SUM(C15:C17)","v":0.1},{"$f":"SUM(D15:D17)","v":0},{"$f":"SUM(B18:D18)","v":0.1}," Vol. max. e nº adições de titulante",null,null,"     Titulante","Mínimo  (mol/L)","Adicional  (mol/L)","Soma  (mol/L)"]
["S[H]",{"$f":"B16+2*B17","v":0},{"$f":"C16+2*C17","v":0},{"$f":"D16+2*D17","v":0},{"$f":"SUM(B19:D19)","v":0},"Volume  (mL)"," Nº de adições ",null,"I > 0.1 mol/L; a exatidão do cálculo de pH diminui com o aumento de I. Leia comentário em P15.",{"$f":"IF(E20<0,-E20,0)","v":0.1},0,{"$f":"J19+K19","v":0.1},null,"I > 0.1 mol/L; a exatidão do cálculo de pH diminui com o aumento de I. Leia comentário em P15."]
["SziCi",{"$f":"R4*B15+(R4+1)*B16+(R4+2)*B17","v":0},{"$f":"S4*C15+(S4+1)*C16+(S4+2)*C17","v":-0.1},{"$f":"T4*D15+(T4+1)*D16+(T4+2)*D17","v":0},{"$f":"SUM(B20:D20)","v":-0.1},50,50,null,"Ânions (monov.)",{"$f":"IF(E20>0,E20,0)","v":0},0,{"$f":"J20+K20","v":0}]
[2,null,null,"]"]
[" ",null,null,null,null,null,null,null,null,null,null,null,null,null,"código de cores"]
[null,null,null,null,null,null,null,null,null,null,null,null,null,null,"N ã o    a l t e r e  "]
[null,null,null,null,null,null,null,null,null,null,null,null,null,null," M u d e   c r I t e r o s a m e n t e"]
[null,null,null,null,null,null,null,null,null,null,null,null,null,null,"Preencha, altere ou deixe em branco"]
[null,null,null,null,null,null,null,null,null,null,null,null,null," Ler dados nas curvas"]
[null,null,null,null,null,null,null,null,null,null,null,null,null," Copiar e colar o gráfico"]
[null,null,null,null,null,null,null,null,null,null,null,null,null," Mudar escalas"]
[null,null,null,null,null,null,null,null,null,null,null,null,null," Gerar outros gráficos"]
[null,null,null,null,null,null,null,null,null,null,null,null,null," Analisar os dados"]
[]
[]
[]
[]
[]
[]
[null,null,null,null,null,null,null,null,null,null,null,null,null,null,null,null,null,null,null,null,null,null,null,null,null,null,null,null,null,null,null,null,null,null,null,null,null,null,null,null,null,null,null,null,null,null,null,null,"     Curva copiada",null,"     Curva copiada"]
[null,null,null,null,null,null,null,null,null,null,null,null,null,null,null,null,null,null,null,null,null,null,null,null,null,null,null,null,null,null,null,null,null,null,null,null,null,null,null,null,null,null,null,null,null,null,null,null,"       de Análise_I",null,"       de Análise_II",null,"     Curvas retidas de simulações anteriores"]
["V adic.",{"$f":"IF(A21=2,\"pH\", \"'pH'\")","v":"pH"},"V adic.",{"$f":"IF(A21=2,\"pH\", \"'pH'\")","v":"pH"},"[H]","CHtot =","      fatores de diluição",null,"h1","h2","h3","h4","h5","h6","h7","h1 titulante","h2 titulante","h3 titulante","        parâmetros calculados somente na opção: atividades, plotar pH",null,null,null,null,null,null,null,null,null,null,null,null,null,null,null,null,null,null,null,null,null,null,null,null,null,null,null,null,null,"Vol","pH","Vol","pH","Vol","pH","Vol","pH","Vol","pH","Vol","pH","Vol","pH","Vol","pH","Vol","pH","Vol","pH","Vol","pH","Vol","pH","Vol","pH","Vol","pH","Vol","pH"]
["(mL)","simulado","com \"erro\" \n(não use)","simulado com \"erro\"",null,"CHcalc","Titulado (amostra)","Titulante (bureta)",{"$f":"K3","v":"Ácido EDTA"},"Ácido fosfórico","Ácido l-glutâmico","Ácido acético","Hidróxido de amônio","Ácido clorídrico","Ácido carbônico","Ácido forte","Base forte","Ác. carbônico","I","íons extras","gH+","p[H]",null,null,null,null,null,null,null,null,null,null,null,null,null,null,null,null,null,null,null,null,null,null,null,null,null,null,null,null,null,null,1,1,2,2,3,3,4,4,5,5,6,6,7,7,8,8,9,9,10,10,11,11,12,12,13,13]
[0,1.8171072203323106,null,null,1.7357856752656456E-2,0.15000000392439017,1,0,null,2.6528429434497318,null,null,null,null,null,null,0.99999999999998657,null,1.7357961286686194E-2,0,0.87780223435735738,1.7605039000095966,null,null,null,null,null,null,null,null,null,null,null,null,null,null,null,null,null,null,null,null,null,null,null,null,null,null,null,null,null,null,0,3.353082640741027,0,1.3864116955262979]
[2.3004442699983274,2.032047786974347,null,null,1.0695068602377461E-2,0.13452646788409006,0.89684311915668358,0.10315688084331645,null,2.5314507916472633,null,null,null,null,null,null,0.99999999999997768,null,2.1010975042030127E-2,1.0315688084331646E-2,0.86849763637200172,1.9708164253478602,null,null,null,null,null,null,null,null,null,null,null,null,null,null,null,null,null,null,null,null,null,null,null,null,null,null,null,null,null,null,0.68944716913392767,3.5408274918499165,3.1178095916402526,1.6072509629846639]
[4.3254293806277717,2.2461395606251631,null,null,6.5897820243305504E-3,0.12332773054295963,0.82218487028430232,0.17781512971569774,null,2.4071577847182537,null,null,null,null,null,null,0.99999999999996314,null,2.4371720628274859E-2,1.7781512971569775E-2,0.86097272332175656,2.1811289506861238,null,null,null,null,null,null,null,null,null,null,null,null,null,null,null,null,null,null,null,null,null,null,null,null,null,null,null,null,null,null,1.4582087154849432,3.7289556504310046,5.4830842549563386,1.8295767720077105]
[5.9982885514807629,2.4592836841503636,null,null,4.0603037477045098E-3,0.11539221099547332,0.76928140713558157,0.23071859286441851,null,2.2946101945542652,null,null,null,null,null,null,0.99999999999993949,null,2.7132952420871277E-2,2.3071859286441853E-2,0.85537744544511207,2.3914414760243874,null,null,null,null,null,null,null,null,null,null,null,null,null,null,null,null,null,null,null,null,null,null,null,null,null,null,null,null,null,null,2.3542375754914246,3.9171403658690189,7.1361621594405733,2.0529474593634975]
[7.2857924010771136,2.6715840410539862,null,null,2.50176204049755E-3,0.10994732920802602,0.73298219469406134,0.2670178053059386,null,2.2031582002122261,null,null,null,null,null,null,0.99999999999990086,null,2.9204946895041845E-2,2.6701780530593862E-2,0.8514712001486715,2.6017540013626514,null,null,null,null,null,null,null,null,null,null,null,null,null,null,null,null,null,null,null,null,null,null,null,null,null,null,null,null,null,null,3.3856183566967957,4.104981039261852,8.2263623175094835,2.2770093808906511]
[8.2150730798798275,2.8832299216443498,null,null,1.5414643081352935E-3,0.10632614671927186,0.70884097812451563,0.29115902187548431,null,2.1350001641515237,null,null,null,null,null,null,0.99999999999983802,null,3.0659788563283712E-2,2.9115902187548434E-2,0.84886105293054914,2.8120665267009151,null,null,null,null,null,null,null,null,null,null,null,null,null,null,null,null,null,null,null,null,null,null,null,null,null,null,null,null,null,null,4.5085039237164892,4.2921165891014637,8.9180936905904673,2.5015107349928822]
[8.8526467421235893,3.0944105888088806,null,null,9.4977546816661196E-4,0.103976596212093,0.69317730809079925,0.3068226919092007,null,2.087331790102688,null,null,null,null,null,null,0.9999999999997361,null,3.1636132747354329E-2,3.068226919092007E-2,0.84716589970197553,3.0223790520391787,null,null,null,null,null,null,null,null,null,null,null,null,null,null,null,null,null,null,null,null,null,null,null,null,null,null,null,null,null,null,5.6376073000137694,4.478332619621276,9.346292847476434,2.7262844425341055]
[9.2745251162433426,3.3052786275549613,null,null,5.8520553163007882E-4,0.10247817814295154,0.68318785412551275,0.31681214587448719,null,2.0554158749731948,null,null,null,null,null,null,0.99999999999957057,null,3.2273221649580255E-2,3.1681214587448721E-2,0.84608296827883944,3.2326915773774427,null,null,null,null,null,null,null,null,null,null,null,null,null,null,null,null,null,null,null,null,null,null,null,null,null,null,null,null,null,null,6.6790875498554669,4.6635941782915484,9.6073197331861593,2.9512243027203571]
[9.5472192681178587,3.5159444786081178,null,null,3.605752367046475E-4,0.10153239710035901,0.67688264734883086,0.3231173526511692,null,2.0346240787037564,null,null,null,null,null,null,0.999999999999302,null,3.2683521578861383E-2,3.2311735265116923E-2,0.84539490683982232,3.4430041027157063,null,null,null,null,null,null,null,null,null,null,null,null,null,null,null,null,null,null,null,null,null,null,null,null,null,null,null,null,null,null,7.5649809048627503,4.8480013819512893,9.7649527495377697,3.1762645496567417]
[9.7213897880461388,3.7264837480225905,null,null,2.2216895483277414E-4,0.10093740639297442,0.67291604270954875,0.32708395729045131,null,2.0212578525778881,null,null,null,null,null,null,0.99999999999886591,null,3.2948934281605932E-2,3.2708395729045131E-2,0.8449536434663556,3.6533166280539699,null,null,null,null,null,null,null,null,null,null,null,null,null,null,null,null,null,null,null,null,null,null,null,null,null,null,null,null,null,null,8.2683403175906278,5.031717381531374,9.8596074545639567,3.4013650938911701]
[9.8327682232089035,3.9369471828142366,null,null,1.3688972360550086E-4,0.10056056405979136,0.67040376040064109,0.32959623959935896,null,2.0126393813511703,null,null,null,null,null,null,0.99999999999815814,null,3.3126498120028158E-2,3.2959623959935895E-2,0.84466008842194706,3.8636291533922336,null,null,null,null,null,null,null,null,null,null,null,null,null,null,null,null,null,null,null,null,null,null,null,null,null,null,null,null,null,null,8.7971470828051679,5.2149114594288255,9.9162514918134548,3.6265017280784404]
[9.9056407354660756,4.1473695043515209,null,null,8.4344801652845916E-5,0.10031552329620627,0.6687701553333163,0.33122984466668365,null,2.0069135460135303,null,null,null,null,null,null,0.99999999999700917,null,3.3256150426479558E-2,3.3122984466668365E-2,0.84444657260448763,4.0739416787304972,null,null,null,null,null,null,null,null,null,null,null,null,null,null,null,null,null,null,null,null,null,null,null,null,null,null,null,null,null,null,9.1788289413671009,5.3977294222803902,9.9500796364736743,3.8516599176710975]
[9.9565126243025528,4.3577763800284215,null,null,5.1969171815699719E-5,0.10014516835185062,0.66763445568009061,0.33236554431990928,null,2.0027919305612265,null,null,null,null,null,null,0.99999999999514377,null,3.336787635259808E-2,3.3236554431990931E-2,0.84426313678787235,4.2842542040687608,null,null,null,null,null,null,null,null,null,null,null,null,null,null,null,null,null,null,null,null,null,null,null,null,null,null,null,null,null,null,9.4463911591446958,5.5802847581417367,9.9702573395916261,4.0768309653786892]
[9.9971799855994892,4.568189978170067,null,null,3.2020880555578243E-5,0.10000940092717606,0.6667293394872551,0.33327066051274495,null,1.9993214784352054,null,null,null,null,null,null,0.99999999999211475,null,3.3487884398105516E-2,3.3327066051274494E-2,0.84406667536987556,4.4945667294070244,null,null,null,null,null,null,null,null,null,null,null,null,null,null,null,null,null,null,null,null,null,null,null,null,null,null,null,null,null,null,9.6302381294663064,5.7626606426347093,9.9822841104469262,4.3020096773616689]
[10.037190472327598,4.7786338760517859,null,null,1.9729711975992238E-5,9.9876185246779423E-2,0.66584123499917303,0.33415876500082703,null,1.9956883491006818,null,null,null,null,null,null,0.99999999998719469,null,3.3644367357541803E-2,3.3415876500082702E-2,0.84381138681261092,4.704879254745288,null,null,null,null,null,null,null,null,null,null,null,null,null,null,null,null,null,null,null,null,null,null,null,null,null,null,null,null,null,null,9.7549627986154519,5.9449158555196302,9.9894494880572893,4.5271929557213983]
[10.085949602359053,4.9891381108161532,null,null,1.2156490636788552E-5,9.9714319777955793E-2,0.66476213179869814,0.33523786820130186,null,1.9910393347218676,null,null,null,null,null,null,0.99999999997919897,null,3.3873735427049419E-2,3.3523786820130186E-2,0.84343898767314673,4.9151917800835516,null,null,null,null,null,null,null,null,null,null,null,null,null,null,null,null,null,null,null,null,null,null,null,null,null,null,null,null,null,null,9.8390408456907608,6.1270910859581083,9.9937174454680644,4.7523789540175265]
[10.15480393873016,5.1997450185032132,null,null,7.4902393295022055E-6,9.9486635894382155E-2,0.66324423929488052,0.33675576070511953,null,1.9842937964427327,null,null,null,null,null,null,0.9999999999661946,null,3.4228304434082597E-2,3.3675576070511956E-2,0.84286746439138982,5.1255043054218152,null,null,null,null,null,null,null,null,null,null,null,null,null,null,null,null,null,null,null,null,null,null,null,null,null,null,null,null,null,null,9.8957675087149255,6.309214284576151,9.9962592605152167,4.9775665722206686]
[10.259427891646595,5.4105160250212876,null,null,4.6151218217071628E-6,9.9142654333944716E-2,0.66095102887966894,0.339048971120331,null,1.9739176528750595,null,null,null,null,null,null,0.99999999994501865,null,3.4786262861466369E-2,3.3904897112033101E-2,0.84197812556355434,5.3358168307600788,null,null,null,null,null,null,null,null,null,null,null,null,null,null,null,null,null,null,null,null,null,null,null,null,null,null,null,null,null,null,9.9345023700152524,6.4913047943471502,9.9977730118553154,5.202755155161106]
[10.422738778845892,5.6215381679324095,null,null,2.843614001131413E-6,9.8610451274028149E-2,0.65740300849924715,0.3425969915007529,null,1.9576397641129131,null,null,null,null,null,null,0.9999999999104745,null,3.5663818868037822E-2,3.425969915007529E-2,0.84060349472962048,5.5461293560983425,null,null,null,null,null,null,null,null,null,null,null,null,null,null,null,null,null,null,null,null,null,null,null,null,null,null,null,null,null,null,9.9618181542609818,6.6733764198713299,9.9986746281501837,5.427944312752996]
[10.678157280989179,5.832925773374515,null,null,1.7520968892733309E-6,9.7789445839954414E-2,0.6519296389001491,0.3480703610998509,null,1.9321307715950855,null,null,null,null,null,null,0.99999999985398091,null,3.7026349141787436E-2,3.480703610998509E-2,0.83852518506197904,5.756441881436607,null,null,null,null,null,null,null,null,null,null,null,null,null,null,null,null,null,null,null,null,null,null,null,null,null,null,null,null,null,null,9.9824373712181114,6.8554397171627715,9.9992118965019472,5.6531338128240902]
[11.071774958241141,6.0448064788874438,null,null,1.0795570383954587E-6,9.6550647741314902E-2,0.643670985223051,0.35632901477694895,null,1.8927893745460747,null,null,null,null,null,null,0.99999999976129661,null,3.9087447616485686E-2,3.5632901477694899E-2,0.83550284110700646,5.9667544067748706,null,null,null,null,null,null,null,null,null,null,null,null,null,null,null,null,null,null,null,null,null,null,null,null,null,null,null,null,null,null,9.999968706688378,7.0375037897783503,9.9995325042982586,5.8783235173525084]
[11.659035151734244,6.2572748251870589,null,null,6.6517063427498744E-7,9.4759678731593702E-2,0.63173119154141022,0.36826880845858984,null,1.8340761199428226,null,null,null,null,null,null,0.99999999960872443,null,4.2070224023931589E-2,3.6826880845858986E-2,0.83136571434460926,6.1770669321131342,null,null,null,null,null,null,null,null,null,null,null,null,null,null,null,null,null,null,null,null,null,null,null,null,null,null,null,null,null,null,10.017501802940387,7.2195778494024481,9.9997245837585069,6.1035133445166174]
[12.487507127567198,6.4703072866018667,null,null,4.0984585062721997E-7,9.2343188636150653E-2,0.61562125777970345,0.38437874222029655,null,1.7512371415442896,null,null,null,null,null,null,0.99999999935696426,null,4.6096404997134063E-2,3.8437874222029655E-2,0.82617523794672942,6.3873794574513978,null,null,null,null,null,null,null,null,null,null,null,null,null,null,null,null,null,null,null,null,null,null,null,null,null,null,null,null,null,null,10.038132137560751,7.4016727738094703,9.9998409408726729,6.3287032462111243]
[13.560292328145474,6.6836852106454243,null,null,2.5252711503031824E-7,8.9391354833207357E-2,0.59594236554634206,0.40405763445365794,null,1.6439642819228899,null,null,null,null,null,null,0.99999999894153024,null,5.101537443806016E-2,4.0405763445365797E-2,0.82036434309113881,6.5976919827896614,null,null,null,null,null,null,null,null,null,null,null,null,null,null,null,null,null,null,null,null,null,null,null,null,null,null,null,null,null,null,10.065490762644913,7.583802879029677,9.9999135694815777,6.5538931948217449]
[14.799194160378374,6.8970304272299172,null,null,1.5559494802239259E-7,8.6208892830705749E-2,0.57472595221103062,0.42527404778896927,null,1.5200785652539486,null,null,null,null,null,null,0.99999999825796715,null,5.6319077984233731E-2,4.2527404778896931E-2,0.81465566990040217,6.808004508127925,null,null,null,null,null,null,null,null,null,null,null,null,null,null,null,null,null,null,null,null,null,null,null,null,null,null,null,null,null,null,10.104356806550641,7.7659881028362863,9.9999624319025315,6.7790831756342191]
[16.054576035651355,7.109980438221382,null,null,9.5870052794863011E-8,8.3207191148021692E-2,0.55471460764776159,0.44528539235223846,null,1.3945447201148788,null,null,null,null,null,null,0.99999999713817,null,6.1321753813883398E-2,4.4528539235223846E-2,0.80972323018237757,7.0183170334661886,null,null,null,null,null,null,null,null,null,null,null,null,null,null,null,null,null,null,null,null,null,null,null,null,null,null,null,null,null,null,10.161435448389966,7.9482567330789253,10.000000968284439,7.0042731827829474]
[17.173922387612194,7.3223490687109374,null,null,5.9070472015370839E-8,8.0701734100520173E-2,0.53801156066902833,0.46198843933097178,null,1.282615330196913,null,null,null,null,null,null,0.99999999531112593,null,6.5497538950118492E-2,4.6198843933097179E-2,0.805898771755863,7.2286295588044522,null,null,null,null,null,null,null,null,null,null,null,null,null,null,null,null,null,null,null,null,null,null,null,null,null,null,null,null,null,null,10.24638257076731,8.1306486159801228,10.000039772421587,7.2294632176513396]
[18.068468956968598,7.5341386525923753,null,null,3.6396356968582683E-8,7.8805375739173955E-2,0.52536917158804963,0.47463082841195037,null,1.1931680593272778,null,null,null,null,null,null,0.99999999233812242,null,6.8658336351484106E-2,4.7463082841195041E-2,0.80316252314550274,7.4389420841427167,null,null,null,null,null,null,null,null,null,null,null,null,null,null,null,null,null,null,null,null,null,null,null,null,null,null,null,null,null,null,10.373125404294115,8.3132182670395611,10.000089510867838,7.454653289233244]
[18.72548397870122,7.7454546504042199,null,null,2.2425668111130016E-8,7.7468366842731715E-2,0.5164557791195038,0.4835442208804962,null,1.1274778362819156,null,null,null,null,null,null,0.99999998750734698,null,7.0887101885767953E-2,4.8354422088049624E-2,0.80130889365311475,7.6492546094809803,null,null,null,null,null,null,null,null,null,null,null,null,null,null,null,null,null,null,null,null,null,null,null,null,null,null,null,null,null,null,10.561402533494402,8.4960361896367385,10.000163859513123,7.6798434166235827]
[19.179874809847981,7.9564249206430109,null,null,1.3817607917865679E-8,7.6569923066119941E-2,0.51046615368510906,0.48953384631489089,null,1.0820566175153761,null,null,null,null,null,null,0.99999997966319665,null,7.2385238859882975E-2,4.8953384631489093E-2,0.80009621902040151,7.859567134819244,null,null,null,null,null,null,null,null,null,null,null,null,null,null,null,null,null,null,null,null,null,null,null,null,null,null,null,null,null,null,10.838089119351935,8.6791847181656561,10.000283257977571,7.9050336342567364]
[19.481817374377648,8.167159454690637,null,null,8.5137391504115883E-9,7.5984344173040452E-2,0.50656229448402945,0.49343770551597066,null,1.0518910771500245,null,null,null,null,null,null,0.99999996692961679,null,7.3362420505331802E-2,4.9343770551597069E-2,0.79931913439604474,8.0698796601575076,null,null,null,null,null,null,null,null,null,null,null,null,null,null,null,null,null,null,null,null,null,null,null,null,null,null,null,null,null,null,11.237055245146621,8.8627423063257744,10.000480541202705,8.1302240013857006]
[19.67773416286737,8.3777400369887793,null,null,5.2457527201602014E-9,7.5609156192147392E-2,0.50406104123793205,0.49593895876206806,null,1.0323458341872529,null,null,null,null,null,null,0.99999994626121325,null,7.3989726537380687E-2,4.9593895876206807E-2,0.79882592771976335,8.2801921854957712,null,null,null,null,null,null,null,null,null,null,null,null,null,null,null,null,null,null,null,null,null,null,null,null,null,null,null,null,null,null,11.794926707807463,9.04675039255517,10.000809955818113,8.3554146183559563]
[19.803712505226017,8.5882232207093221,null,null,3.2321781434586033E-9,7.5369853992644759E-2,0.50246569327112778,0.49753430672887222,null,1.0198232691848867,null,null,null,null,null,null,0.99999991271458422,null,7.4391807037924876E-2,4.9753430672887226E-2,0.798512086399777,8.4905047108340348,null,null,null,null,null,null,null,null,null,null,null,null,null,null,null,null,null,null,null,null,null,null,null,null,null,null,null,null,null,null,12.539179688610602,9.231166912280317,10.001362081675325,8.5806056541966989]
[19.885540108308714,8.798646878983913,null,null,1.9915112488818308E-9,7.5215228127685732E-2,0.50143485447834568,0.49856514552165426,null,1.0117626302747456,null,null,null,null,null,null,0.99999985826521398,null,7.4654782996030039E-2,4.9856514552165429E-2,0.79830777886229876,8.7008172361722984,null,null,null,null,null,null,null,null,null,null,null,null,null,null,null,null,null,null,null,null,null,null,null,null,null,null,null,null,null,null,13.468123345228378,9.4158342111909406,10.002288770920131,8.8057973930797129]
[19.941073821819778,9.009036446165327,null,null,1.2270725431547262E-9,7.5110649587512138E-2,0.50073766392014263,0.49926233607985732,null,1.0064075009814757,null,null,null,null,null,null,0.99999976988600991,null,7.4837619266396246E-2,4.9926233607985732E-2,0.79816617530088507,8.911129761510562,null,null,null,null,null,null,null,null,null,null,null,null,null,null,null,null,null,null,null,null,null,null,null,null,null,null,null,null,null,null,14.532993528700899,9.60050443993714,10.003844932361972,9.0309903124075408]
[19.982924715427686,9.2194098816679926,null,null,7.5606252639025419E-10,7.5032029829494529E-2,0.50021353221023535,0.49978646778976471,null,1.0025443327295511,null,null,null,null,null,null,0.99999962642542906,null,7.4982480392023695E-2,4.9978646778976475E-2,0.79805423968131639,9.1214422868488256,null,null,null,null,null,null,null,null,null,null,null,null,null,null,null,null,null,null,null,null,null,null,null,null,null,null,null,null,null,null,15.64163693547016,9.7849285539922946,10.006458779389504,9.2561852139633451]
[20.02083246216479,9.4297815038007933,null,null,4.658490217228622E-10,7.4960959465488905E-2,0.49973972977468067,0.50026027022531938,null,0.99927655774245971,null,null,null,null,null,null,0.999999393531953,null,7.5123290074031956E-2,5.0026027022531942E-2,0.79794565152555419,9.3317548121870892,null,null,null,null,null,null,null,null,null,null,null,null,null,null,null,null,null,null,null,null,null,null,null,null,null,null,null,null,null,null,16.690479229146149,9.9689466492654955,10.010849985701498,9.4813834440142948]
[20.063731152131702,9.6401651663066854,null,null,2.8703355009044805E-10,7.4880694177105689E-2,0.49920462784437075,0.50079537215562919,null,0.99583692660796641,null,null,null,null,null,null,0.99999901539381497,null,7.5293130495628871E-2,5.0079537215562922E-2,0.79781495923039991,9.5420673375253529,null,null,null,null,null,null,null,null,null,null,null,null,null,null,null,null,null,null,null,null,null,null,null,null,null,null,null,null,null,null,17.603331759164575,10.152515464383894,10.018228740955237,9.7065872625598999]
[20.121755055457047,9.8505772939239424,null,null,1.7685613800975045E-10,7.4772402050957434E-2,0.4984826803082007,0.50151731969179936,null,0.99141820179504692,null,null,null,null,null,null,0.99999840127405593,null,7.5531561718069865E-2,5.0151731969179936E-2,0.79763200716288241,9.7523798628636165,null,null,null,null,null,null,null,null,null,null,null,null,null,null,null,null,null,null,null,null,null,null,null,null,null,null,null,null,null,null,18.35030156216817,10.335676962617459,10.03063188836677,9.9318004621133511]
[20.208536056861433,10.061040233181268,null,null,1.0897016582858609E-10,7.4611022787328132E-2,0.49740681858490782,0.50259318141509213,null,0.98499558489212025,null,null,null,null,null,null,0.99999740350827659,null,7.5893027376269143E-2,5.0259318141509218E-2,0.79735580246167992,9.9626923882018801,null,null,null,null,null,null,null,null,null,null,null,null,null,null,null,null,null,null,null,null,null,null,null,null,null,null,null,null,null,null,18.942612658429425,10.518511475237084,10.051492501224857,10.157029403192565]
[20.344214425694414,10.27158617793776,null,null,6.7142125652743168E-11,7.4360104477559683E-2,0.49573402989010495,0.50426597010989493,null,0.97511397302740999,null,null,null,null,null,null,0.99999578142667422,null,7.6457324853846001E-2,5.0426597010989498E-2,0.79692736433869771,10.173004913540144,null,null,null,null,null,null,null,null,null,null,null,null,null,null,null,null,null,null,null,null,null,null,null,null,null,null,null,null,null,null,19.416979695961345,10.701104280413743,10.086610914731864,10.38228474269382]
[20.559627960521674,10.48226134941582,null,null,4.1369718058978618E-11,7.3965175463378705E-2,0.49310116994827491,0.50689883005172509,null,0.95962168115098412,null,null,null,null,null,null,0.99999314192431665,null,7.7342219671164461E-2,5.0689883005172513E-2,0.79626218896963086,10.383317438878407,null,null,null,null,null,null,null,null,null,null,null,null,null,null,null,null,null,null,null,null,null,null,null,null,null,null,null,null,null,null,19.822495484550018,10.883530080759435,10.145826595544349,10.607584306646606]
[20.902049192146301,10.69312859620427,null,null,2.5490011757014698E-11,7.3345958432753919E-2,0.48897305621005716,0.51102694378994284,null,0.93536730870759333,null,null,null,null,null,null,0.99998884107460939,null,7.871539697196156E-2,5.1102694378994284E-2,0.79524577788399853,10.593629964216671,null,null,null,null,null,null,null,null,null,null,null,null,null,null,null,null,null,null,null,null,null,null,null,null,null,null,null,null,null,null,20.215055385779124,11.065849475536167,10.245943551126402,10.832957830787768]
[21.44228569471289,10.904263365785328,null,null,1.5705707697752415E-11,7.2389829605858241E-2,0.4825988639621423,0.51740113603785765,null,0.89798277291422324,null,null,null,null,null,null,0.99998182073423547,null,8.0795532166209522E-2,5.1740113603785769E-2,0.79374157357907027,10.803942489554935,null,null,null,null,null,null,null,null,null,null,null,null,null,null,null,null,null,null,null,null,null,null,null,null,null,null,null,null,null,null,20.659375215473119,11.248111321477786,10.415984124119859,11.058454687920037]
[22.281442626859544,11.115733445460259,null,null,9.6770945670261418E-12,7.0953113521420738E-2,0.47302075703762481,0.52697924296237519,null,0.84212579527609799,null,null,null,null,null,null,0.99997033809868729,null,8.3817936516434877E-2,5.2697924296237521E-2,0.79162877772131968,11.014255014893198,null,null,null,null,null,null,null,null,null,null,null,null,null,null,null,null,null,null,null,null,null,null,null,null,null,null,null,null,null,null,21.238175708276685,11.430357396969191,10.707017914683092,11.284156219807242]
[23.553723567065564,11.327553152423693,null,null,5.962555846660016E-12,6.8880448190332524E-2,0.45920298790635994,0.54079701209364017,null,0.76292727823368822,null,null,null,null,null,null,0.99995152501276718,null,8.7926940438776885E-2,5.407970120936402E-2,0.78888625987316252,11.224567540231462,null,null,null,null,null,null,null,null,null,null,null,null,null,null,null,null,null,null,null,null,null,null,null,null,null,null,null,null,null,null,22.070677862211596,11.612627884233907,11.211729601200204,11.510194694607463]
[25.425947284175155,11.539624052110103,null,null,3.6738374290233909E-12,6.6041550164391949E-2,0.44027700456930957,0.55972299543069048,null,0.6592911713459394,null,null,null,null,null,null,0.99992068897101305,null,9.2987097586830658E-2,5.5972299543069051E-2,0.78569866945925826,11.434880065569725,null,null,null,null,null,null,null,null,null,null,null,null,null,null,null,null,null,null,null,null,null,null,null,null,null,null,null,null,null,null,23.348587220243644,11.794967391156714,12.107096232648473,11.736780505153671]
[28.122491988603517,11.75171816931954,null,null,2.2636402579698634E-12,6.2340911200312626E-2,0.41560607469655664,0.58439392530344347,null,0.53773219880036927,null,null,null,null,null,null,0.99987022609431842,null,9.8431976839077923E-2,5.8439392530344351E-2,0.7824821260269792,11.645192590907989,null,null,null,null,null,null,null,null,null,null,null,null,null,null,null,null,null,null,null,null,null,null,null,null,null,null,null,null,null,null,25.413084276078735,11.977431804206329,13.760415789147373,11.964236064627583]
[32.065280894638896,11.963554363265594,null,null,1.3947452266182587E-12,5.7619971425255559E-2,0.38413314316833691,0.61586685683166309,null,0.41238444609826386,null,null,null,null,null,null,0.99978791425254765,null,0.10336566841056349,6.158668568316631E-2,0.77974169418325612,11.855505116246253,null,null,null,null,null,null,null,null,null,null,null,null,null,null,null,null,null,null,null,null,null,null,null,null,null,null,null,null,null,null,28.945042788109276,12.160096419814815,17.047096470196266,12.193024702356251]
[38.317482636090951,12.174908796008481,null,null,8.5937429338664664E-13,5.1442549662562467E-2,0.34295033146068271,0.65704966853931734,null,0.298849217859118,null,null,null,null,null,null,0.99965418030131148,null,0.10689849826648898,6.5704966853931734E-2,0.77787327333990652,12.065817641584516,null,null,null,null,null,null,null,null,null,null,null,null,null,null,null,null,null,null,null,null,null,null,null,null,null,null,null,null,null,null,35.536279213556554,12.343065535500466,24.627392178808805,12.423738905573176]
[50,12.385644648704332,null,null,5.2950471673199133E-13,4.2855511206788537E-2,0.28573108354400611,0.71426891645599389,null,0.20703356942426254,null,null,null,null,null,null,0.99943776888184777,null,0.10837293667005463,7.1426891645599386E-2,0.77711541294751063,12.27613016692278,null,null,null,null,null,null,null,null,null,null,null,null,null,null,null,null,null,null,null,null,null,null,null,null,null,null,null,null,null,null,49.999999986903276,12.52648266198166,49.999999998544808,12.656969396779232]

{"sheet":"Distribuição","index":5,"n_rows":82,"n_cols":64,"rows_kept":82,"cut":false,"hidden":false,"merged":[]}
[null,"     Distribuição das Espécies e Protonação Média das Bases vs. pH e vs. Volume",null,null,null,null,null,null,null,"<--- leia instruções"]
[null,null,null,"    Sistema ácido/base HiB",null,"   Const. globais de protonação bp",null,"Corrig. para I","Espécie","Cor da curva",null,null,"código de cores",null,null,null,null,null,null,null,null,null,null,null,null,"Opções do seletor em K12 (não modifique)"]
[null,null,null,null,6,"Força Iônica, I ",0,{"$f":"IF(C7<0,0,IF(C7>3,3,C7))","v":0.1},"a B",null," ",null,"N ã o    a l t e r e  ",null,null,null,null,null,null,null,null,null,null,null,null,"Curva de titulação do Titulador"]
[null,null,null,"pKa1 = logKpn",{"$f":"IF(VLOOKUP(E$3,Constantes!$B$23:$N$303,4)=\"\",\"\",VLOOKUP(E$3,Constantes!$B$23:$N$303,4))","v":2.1480000000000001},"bp1",{"$f":"IF(E4=\"\",\"\",IF(E5=\"\",10^E4,(IF(E6=\"\",10^E5,(IF(E7=\"\",10^E6,(IF(E8=\"\",10^E7,(IF(E9=\"\",10^E8,10^E9))))))))))","v":2238721138568.3457},{"$f":"IF(G4=\"\",\"\",(G4*$H$10^(-2*$E$10)))","v":510372321828.43945},"a HB",null,null,null," M u d e   c r I t e r o s a m e n t e",null,null,null,null,null,null,null,null,null,null,null,null,"Curva de titulação do Simulador"]
[null,"do sistema ácido/base",null,"pKa2 = logKpn-1",{"$f":"IF(VLOOKUP(E$3,Constantes!$B$23:$N$303,5)=\"\",\"\",VLOOKUP(E$3,Constantes!$B$23:$N$303,5))","v":7.1989999999999998},"bp2",{"$f":"IF(E5=\"\",\"\",IF(E6=\"\",G4*10^E4,(IF(E7=\"\",G4*10^E5,(IF(E8=\"\",G4*10^E6,(IF(E9=\"\",G4*10^E7,G4*10^E8))))))))","v":3.539973410834362E+19},{"$f":"IF(G5=\"\",\"\",(G5*$H$10^(-4*$E$10-2)))","v":3.0117010241596421E+18},"a H2B",null,null,null,"Preencha, altere ou deixe em branco",null,null,null,null,null,null,null,null,null,null,null,null,"Curva de titulação da Análise I"]
[null,{"$f":"IF(VLOOKUP(E$3,Constantes!$B$23:$N$303,2)=\"\",\"\",VLOOKUP(E$3,Constantes!$B$23:$N$303,2))","v":"Ácido fosfórico"},null,"pKa3 = logKpn-2",{"$f":"IF(VLOOKUP(E$3,Constantes!$B$23:$N$303,6)=\"\",\"\",VLOOKUP(E$3,Constantes!$B$23:$N$303,6))","v":12.35},"bp3",{"$f":"IF(E6=\"\",\"\",IF(E7=\"\",G5*10^E4,(IF(E8=\"\",G5*10^E5,(IF(E9=\"\",G5*10^E6,G5*10^E7))))))","v":4.9773708497893867E+21},{"$f":"IF(G6=\"\",\"\",(G6*$H$10^(-6*$E$10-6)))","v":2.5868677582221171E+20},"a H3B",null,null,null,null,null,null,null,null,null,null,null,null,null,null,null,null,"Curva de titulação da Análise II (regressão)"]
[null,"em força iônica I (mol/L)",0.1,"pKa4 = logKpn-3",{"$f":"IF(VLOOKUP(E$3,Constantes!$B$23:$N$303,7)=\"\",\"\",VLOOKUP(E$3,Constantes!$B$23:$N$303,7))","v":""},"bp4",{"$f":"IF(E7=\"\",\"\",IF(E8=\"\",G6*10^E4,(IF(E9=\"\",G6*10^E5,G6*10^E6))))","v":""},{"$f":"IF(G7=\"\",\"\",(G7*$H$10^(-8*$E$10-12)))","v":""},"a H4B",null,null,null," Ler dados nas curvas",null,null,null,null,null,null,null,null,null,null,null,null,"Nenhuma titulação"]
[null,"Gerar Capacidade de Tamponamento",null,"pKa5 = logKpn-4",{"$f":"IF(VLOOKUP(E$3,Constantes!$B$23:$N$303,8)=\"\",\"\",VLOOKUP(E$3,Constantes!$B$23:$N$303,8))","v":""},"bp5",{"$f":"IF(E8=\"\",\"\",IF(E9=\"\",G7*10^E4,G7*10^E5))","v":""},{"$f":"IF(G8=\"\",\"\",(G8*$H$10^(-10*$E$10-20)))","v":""},"a H5B",null,null,null," Copiar e colar o gráfico"]
[null,"para S[HiB] (mol/L)",0.05,"pKa6 = logKpn-5",{"$f":"IF(VLOOKUP(E$3,Constantes!$B$23:$N$303,9)=\"\",\"\",VLOOKUP(E$3,Constantes!$B$23:$N$303,9))","v":""},"bp6",{"$f":"IF(E9=\"\",\"\",G8*10^E4)","v":""},{"$f":"IF(G9=\"\",\"\",(G9*$H$10^(-12*$E$10-30)))","v":""},"a H6B",null,null,null," Mudar escalas",null,null,"Fração molar de cada espécie em função do pH",null,null,null,null,null,null,null,null,null,"Fração molar de cada espécie durante a titulação",null,null,null,null,null,null,null,null,null,null,null,null,"logaritmo da fração molar de cada espécie em função do pH",null,null,null,null,null,null,null,null,null,null,null,"logaritmo da fração molar de cada espécie durante a titulação",null,null,null,null,null,null,null,null,null,null,"Carga média das espécies HiB"]
[null,{"$f":"IF(C9>C7,\"Geralmente C9 <= C7\",\"\")","v":""},null,"Carga de B",{"$f":"IF(VLOOKUP(E$3,Constantes!$B$23:$N$303,3)=\"\",\"\",VLOOKUP(E$3,Constantes!$B$23:$N$303,3))","v":-3},"gH+",1,{"$f":"10^(-0.509*(H3^0.5/(1+H3^0.5)-0.3*H3))","v":0.78159394394683346},null,null,null,null," Gerar outros gráficos",null,null,null,"alfa 0","alfa 1","alfa 2","alfa 3","alfa 4","alfa 5 ","alfa 6","Capac.",null,null,null,"alfa 0","alfa 1","alfa 2","alfa 3","alfa 4","alfa 5 ","alfa 6",null,null,null,"Capac.",null,"log alfa 0","log alfa 1","log alfa 2","log alfa 3","log alfa 4","log alfa 5","log alfa 6","Capac.",null,null,"log alfa 0","log alfa 1","log alfa 2","log alfa 3","log alfa 4","log alfa 5","log alfa 6",null,null,"Capac.","vs",null,"vs"]
[null,{"$f":"IF(C7>0.1, \"I < 0,1 dá resultados mais precisos \",\"\")","v":""},null,"Protonações, n",{"$f":"IF(E4=\"\",\"\",IF(E5=\"\",1,(IF(E6=\"\",2,(IF(E7=\"\",3,(IF(E8=\"\",4,(IF(E9=\"\",5,6))))))))))","v":3},"pKw",13.997,{"$f":"G11+LOG10(H10^2)","v":13.782962371327621},null,null,null,null,null,null,"pH","h médio","B","HB","H2B","H3B","H4B","H5B","H6B","tampão","Vol","pH","h médio","B","HB","H2B","H3B","H4B","H5B","H6B",null,null,null,"tampão","pH","B","HB","H2B","H3B","H4B","H5B","H6B","tampão","Vol","pH","B","HB","H2B","H3B","H4B","H5B","H6B",null,null,"tampão","pH","zm","Vol","zm"]
[null,null,"Não há Ponto Isoelétrico entre pH ","0 e 14","para",null,{"$f":"IF(VLOOKUP(E$3,Constantes!$B$23:$N$303,2)=\"\",\"\",VLOOKUP(E$3,Constantes!$B$23:$N$303,2))","v":"Ácido fosfórico"},null,null,"Plotar curvas sobrepostas à ",2,null,null,null,0,2.9909825254290823,1.829091055273542E-21,1.1943765121842975E-9,9.0174721821650351E-3,0.99098252662345854,null,null,null,2.9470598353394553,0,1.8171072800722754,2.6260869886675571,3.2668417879467625E-16,3.2503247173949048E-6,0.37390651068300745,0.62609023899227489,null,null,null,0.12979337714801967,0.38938013144405897,6.4896688574009834E-2,7.1840897036083165E-2,0,null,-8.9228009792610283,-2.0449019499971892,-3.9339776221329632E-3,null,null,null,0.46938591477603636,0,0,-15.485771642394713,-5.4880377197815591,-0.42723420665833445,-0.20336175042389248,null,null,null,-6.9616529828158429,-3.4808264914079214,-1.1436208496845741,0,-9.0174745709177273E-3,1.8171072800722754,-0.37391301133244292,-2.6106198685559412]
[null,null,null,null,null,null,null,null,null,null,null,null,null,null,0.2,2.985783246577463,7.2435383431911843E-21,2.9843976661383275E-9,1.4216747453741053E-2,0.98578324956186125,null,null,null,1.8604334118625532,2.3004448812571354,2.03204784726322,2.5051316407982851,1.1633851356765297E-15,7.0563740093412916E-6,0.49485424645369247,0.50513869717229698,null,null,null,0.14514627480451572,0.43543882441354714,7.2573137402257862E-2,5.6145715881996808E-2,0.2,null,-8.5250881166298509,-1.8471877925683082,-6.2185253955491307E-3,null,null,null,0.26961238500444712,2.3004448812571354,0.2,-14.934179805055596,-5.1513850581106215,-0.30552072065557867,-0.29658744008931792,null,null,null,-6.8388298015638744,-3.4194149007819372,-1.2506752794435696,0.2,-1.4216753422537032E-2,2.03204784726322,-0.4948683592017149,-2.5645611755864528]
[null,null,null,null,null,null,null,null,null,null,null,null,null,null,0.4,2.9776537739493611,2.8599234805983471E-20,7.434646809223417E-9,2.2346211181345322E-2,0.97765378138400783,null,null,null,1.1753513038547314,4.3254298929241486,2.2461396194374883,2.3840296933706888,3.881228876256072E-15,1.437922775878907E-5,0.61594154817378177,0.38404407259845547,null,null,null,0.16043854424553489,0.48131563273660466,8.0219272122767443E-2,4.3952080409881279E-2,0.4,-19.543519061253633,-8.1286870329044589,-1.6507854140452141,-9.8148520747523334E-3,null,null,null,7.0167239170475265E-2,4.3254298929241486,0.4,-14.410937449290524,-4.8422330884921418,-0.21045913718369266,-0.41561624276402592,null,null,null,-6.7164916460357205,-3.3582458230178602,-1.3570117780499349,0.4,-2.2346226050638851E-2,2.2461396194374883,-0.61597030662931118,-2.5186843672633952]
[null,null,null,null,null,null,null,null,null,null,null,null,null,null,0.60000000000000009,2.9650405304631682,1.1238669265176895E-19,1.8434052464173964E-8,3.4959432668727204E-2,0.96504054889722035,null,null,null,0.74389371350979905,5.9982889695675112,2.4592837415154789,2.2762072864983911,1.2170238265135317E-14,2.760077441796993E-5,0.72373751195273617,0.27623488727283357,null,null,null,0.17566312439396278,0.52698937318188832,8.7831562196981391E-2,3.325461507161067E-2,0.60000000000000009,-18.949162431686879,-7.7343291085399981,-1.4564261948830513,-1.5454338114886345E-2,null,null,null,-0.12848827957092057,5.9982889695675112,0.60000000000000009,-13.914610835590624,-4.5590492169776367,-0.14041800785457997,-0.55871785562030563,null,null,null,-6.5946950048482975,-3.2973475024241488,-1.4781385053269342,0.60000000000000009,-3.4959469536831822E-2,2.4592837415154789,-0.7237927135016089,-2.4730106268181116]
[null,null,null,null,null,null,null,null,null,null,null,null,null,null,0.8,2.9457031781759282,4.3845416348057186E-19,4.5376409317351823E-8,5.4296731071253164E-2,0.94570322355233749,null,null,null,0.47282623367197241,7.2857926934375428,2.6715840969865385,2.189631424696652,3.6219904085004806E-14,5.0381271896018047E-5,0.8102678127594467,0.18968180596862091,null,null,null,0.19082743549903847,0.5724823064971154,9.5413717749519233E-2,2.3979353609321779E-2,0.8,-18.357956951614412,-7.3431223336698297,-1.2652181252151795,-2.4244973649311632E-2,null,null,null,-0.32529632965330663,7.2857926934375428,0.8,-13.440965686867617,-4.2977030492956256,-9.1370821213565503E-2,-0.72196965002028779,null,null,null,-6.4733805160076923,-3.2366902580038461,-1.6201520390662025,0.8,-5.4296821824071806E-2,2.6715840969865385,-0.81036857530334805,-2.4275176935028844]
[null,null,null,null,null,null,null,null,null,null,null,null,null,null,1,2.9165940469207148,1.6917898444844041E-18,1.1047203188590904E-7,8.3405732135221289E-2,0.91659415739274686,null,null,null,0.30340474636721804,8.2150732792797498,2.8832299762264122,2.1256197211122743,1.0356736030263798E-13,8.8490950361823202E-5,0.87420329698669108,0.12570821206284352,null,null,null,0.20594499830188659,0.61783499490565974,0.10297249915094329,1.6521035564471959E-2,1,-17.771538532880388,-6.9567026201381053,-1.0787971168857524,-3.7822670522181558E-2,null,null,null,-0.51797427615036951,8.2150732792797498,1,-12.984693029496828,-4.0530749009717182,-5.8387181936540286E-2,-0.90063051979014475,null,null,null,-6.3524400135849071,-3.1762200067924535,-1.7819511974955422,1,-8.3405953079285222E-2,2.8832299762264122,-0.87438027888772574,-2.3821650050943401]
[null,null,null,null,null,null,null,null,null,null,null,null,null,null,1.2,2.8739590030275246,6.4218553806404168E-18,2.6458574942557291E-7,0.1260404678009768,0.8739592676132738,null,null,null,0.19856415799438068,8.852646873856429,3.0944106420923969,2.0810769624610548,2.878113919539166E-13,1.5121792211044108E-4,0.91862060169386095,8.1228180383740842E-2,null,null,null,0.22102933157802834,0.66308799473408508,0.11051466578901417,1.0982833597039278E-2,1.2,-17.192228175907097,-6.5773909683671103,-0.89948417031705397,-5.8508429155780223E-2,null,null,null,-0.70209459610867064,8.852646873856429,1.2,-12.540810830520778,-3.8203720006804476,-3.686358033004869E-2,-1.0902862168684324,null,null,null,-6.2317653473757737,-3.1158826736878869,-1.9592729120332253,1.2,-0.12604099697247539,3.0944106420923969,-0.91892303753894522,-2.3369120052659147]
[null,null,null,null,null,null,null,null,null,null,null,null,null,null,1.4,2.8139534563738851,2.3810539237437955E-17,6.1897792290047827E-7,0.18604530567026856,0.81395407535180841,null,null,null,0.13471825715196345,9.2745251997257583,3.3052786795679925,2.0513382707540981,7.8448918912047788E-13,2.5363793680209762E-4,0.94815445336994453,5.1591908692468998E-2,null,null,null,0.23609133425485659,0.70827400276456987,0.1180456671274283,7.1242144586484172E-3,1.4,-16.623123150408691,-6.208284648071003,-0.73037655522324396,-8.9399519264267049E-2,null,null,null,-0.87056790818603991,9.2745251997257583,1.4,-12.105334666651197,-3.5957625091292118,-2.312076109715553E-2,-1.2874100699538822,null,null,null,-6.111269325961147,-3.0556346629805735,-2.1472491141854091,1.4,-0.18604654362611495,3.3052786795679925,-0.94866172924590186,-2.2917259972354302]
[null,null,null,null,null,null,null,null,null,null,null,null,null,null,1.5999999999999999,2.7340725323978314,8.5488782587888467E-17,1.4022164600985738E-6,0.26592466316924818,0.7340739346142916,null,null,null,9.647580921706285E-2,9.5472193221212365,3.5159445293883027,2.0319796658593394,2.1112847262447337E-12,4.2025046708891496E-4,0.96717983320014889,3.2399916330650855E-2,null,null,null,0.25113889495630731,0.75341668486892199,0.12556944747815366,4.558876574343446E-3,1.5999999999999999,-16.067986842855802,-5.8531470457204069,-0.57523765807494465,-0.1342593273182647,null,null,null,-1.0155749951149011,9.5472193221212365,1.5999999999999999,-11.675377607370903,-3.3764699358209342,-1.4492673760896163E-2,-1.4894464685896409,null,null,null,-5.9908888403495411,-2.9954444201747705,-2.3411270090698828,1.5999999999999999,-0.26592746760216857,3.5159445293883027,-0.96802033414066058,-2.2465833151310779]
[null,null,null,null,null,null,null,null,null,null,null,null,null,null,1.7999999999999998,2.6352619881655723,2.9452643612770548E-16,3.0481070163458119E-6,0.36473191562039453,0.63526503627258879,null,null,null,7.3368250782854305E-2,9.7213898246991448,3.7264837975794283,2.0195081270624855,5.6357236557403817E-12,6.9083100428200199E-4,0.97911021091204298,2.0198958078039158E-2,null,null,null,0.26617741411281631,0.79853224233844888,0.13308870705640816,2.9142630421140946E-3,1.7999999999999998,-15.530775170977027,-5.5159340790439293,-0.43802339660076417,-0.19704377104638138,null,null,null,-1.1344844903939,9.7213898246991448,1.7999999999999998,-11.248977484182154,-3.1606077177945071,-9.1683608967905537E-3,-1.6946600608878566,null,null,null,-5.8705806870974691,-2.9352903435487345,-2.535454836656073,1.7999999999999998,-0.36473801183442767,3.7264837975794283,-0.9804918729375145,-2.2014677576615513]
[null,null,null,null,null,null,null,null,null,null,null,null,null,null,1.9999999999999998,2.5235635632819284,9.6637119913681631E-16,6.3102985440370833E-6,0.47642381612098039,0.52356987358047458,null,null,null,5.8180338206695402E-2,9.8327682426315732,3.9369472311575628,2.0114032510373887,1.4964778899630456E-11,1.1298713639788921E-3,0.98633700618975939,1.2533122431297014E-2,null,null,null,0.2812105165112545,0.84363154953376351,0.14060525825562725,1.8986855477912637E-3,1.9999999999999998,-15.014758815849069,-5.1999164291182689,-0.32200445187740029,-0.28102353152531434,null,null,null,-1.2352157616706074,9.8327682426315732,1.9999999999999998,-10.824859614883826,-2.9469519195364602,-5.9746336790264774E-3,-1.9019284047103753,null,null,null,-5.750315867909964,-2.875157933954982,-2.721529336045116,1.9999999999999998,-0.47643643671807157,3.9369472311575628,-0.98859674896261129,-2.1563684504662364]
[null,null,null,null,null,null,null,null,null,null,null,null,null,null,2.1999999999999997,2.4094531194103186,3.0087538662138324E-15,1.2396314606042857E-5,0.59052208796046002,0.40946551572493084,null,null,null,4.6429632781777051E-2,9.9056407503667288,4.1473695514894615,2.0059104123474425,3.9600702191576803E-11,1.8417864080074522E-3,0.99040601471774037,7.752198834651565E-3,null,null,null,0.29624068224924727,0.8887220467477418,0.14812034112462363,1.3103642106018175E-3,2.1999999999999997,-14.521519325895209,-4.9066756443667074,-0.22876237232813557,-0.38778015717834674,null,null,null,-1.3331961200615821,9.9056407503667288,2.1999999999999997,-10.402229768832971,-2.7347430315458201,-4.1867037485998513E-3,-2.1105614328401625,null,null,null,-5.6300745420060219,-2.8150372710030109,-2.8825893151438562,2.1999999999999997,-0.59054688058968141,4.1473695514894615,-0.9940895876525575,-2.1112779532522583]
[null,null,null,null,null,null,null,null,null,null,null,null,null,null,2.4,2.3043191633466358,8.9029033321061858E-15,2.3143955528845022E-5,0.69563454874227915,0.30434230730218298,null,null,null,3.6107748192569761E-2,9.956512633652892,4.3577764259656462,2.0017889345924105,1.0454699217274665E-10,2.995304955406816E-3,0.99222045518313517,4.784239756911053E-3,null,null,null,0.31126974471183189,0.93380923413549566,0.15563487235591594,1.0245502868026332E-3,2.4,-14.050377379605333,-4.6355324032791252,-0.15761783644285099,-0.51663432649535923,null,null,null,-1.4423902567967499,9.956512633652892,2.4,-9.9806238424991154,-2.5235426175164606,-3.3918020237361079E-3,-2.3201720434197943,null,null,null,-5.5098420423053449,-2.7549210211526725,-2.9894473669986659,2.4,-0.69568083665336422,4.3577764259656462,-0.99821106540758953,-2.0661907658645045]
[null,null,null,null,null,null,null,null,null,null,null,null,null,null,2.6,2.2162788253141601,2.5192211706521684E-14,4.1321133430407849E-5,0.78363853241890358,0.21632014644764086,null,null,null,2.6924409176750812E-2,9.9971799951163121,4.568190022913047,1.9980847429450062,2.7550259559188558E-10,4.8622983125186214E-3,0.99219065960344843,2.9470418085303209E-3,null,null,null,0.32629928735093194,0.97889786205279583,0.16314964367546597,9.7829283675257149E-4,2.6,-13.59864566465169,-4.3837993935277799,-0.10588353189380291,-0.66489872714860843,null,null,null,-1.5698436547713912,9.9971799951163121,2.6,-9.559812414658996,-2.3131434244085316,-3.4048436479981771E-3,-2.530597319776247,null,null,null,-5.3896057011925445,-2.6948028505962722,-3.0095116427801258,2.6,-0.78372117468583991,4.568190022913047,-1.0019152570549938,-2.0211021379472043]
[null,null,null,null,null,null,null,null,null,null,null,null,null,null,2.8000000000000003,2.1482551205737859,6.8768169314948149E-14,7.1169414245471254E-5,0.85160254059751683,0.14832628998816885,null,null,null,1.9223634885413371E-2,10.037190483126324,4.7786339196049799,1.9939330103462396,7.2475168089862849E-10,7.8788211123773152E-3,0.99030934525475101,1.811832908120057E-3,null,null,null,0.34133099425749858,1.0239929827724956,0.17066549712874929,1.160495343663313E-3,2.8000000000000003,-13.162527322303205,-4.1476797563815948,-6.9762599949914753E-2,-0.82877650040701756,null,null,null,-1.7161533802537337,10.037190483126324,2.8000000000000003,-9.1397515976934134,-2.1035251417235115,-4.2290952435405432E-3,-2.7418641056523523,null,null,null,-5.2693520459400114,-2.6346760229700057,-2.9353375942898112,2.8000000000000003,-0.85174487942621413,4.7786339196049799,-1.0060669896537604,-1.9760070172275044]
[null,null,null,null,null,null,null,null,null,null,null,null,null,null,3.0000000000000004,2.0988834015730835,1.8273278510425108E-13,1.1932251590498218E-4,0.90087795339455845,9.9002724089353858E-2,null,null,null,1.3232219522617399E-2,10.085949620406609,4.989138153184598,1.9883721175668378,1.9026972515378305E-9,1.2739062430535441E-2,0.98614975186399989,1.1111838027675187E-3,null,null,null,0.35636701094175699,1.069101032825271,0.17818350547087849,1.6092225748985814E-3,3.0000000000000004,-12.738101059616852,-3.9232521988975373,-4.5333747668154678E-2,-1.0043463533275547,null,null,null,-1.8783551422548281,10.085949620406609,3.0000000000000004,-8.7205738519020031,-1.8948502667097291,-6.0570910073858035E-3,-2.9541949721938252,null,null,null,-5.1490639124659445,-2.5745319562329723,-2.7933657992443965,3.0000000000000004,-0.90111659842691649,4.989138153184598,-1.0116278824331622,-1.930898967174729]
[null,null,null,null,null,null,null,null,null,null,null,null,null,null,3.2000000000000006,2.0646343675537921,4.7637572914094328E-13,1.9627073771060302E-4,0.93497309096935788,6.4830638292455223E-2,null,null,null,8.8644007327202679E-3,10.154803957266267,5.1997450596983432,1.9801443292447669,4.9811366491674657E-9,2.0534745496303703E-2,0.97878616481921565,6.7908470334399887E-4,null,null,null,0.37141036140702449,1.1142310842210734,0.18570518070351225,2.4155646442618256E-3,3.2000000000000006,-12.321970600675307,-3.7071204451582895,-2.9200699131204124E-2,-1.1882120099929012,null,null,null,-2.0523373321388125,10.154803957266267,3.2000000000000006,-8.3026177925599605,-1.6874997504147367,-9.3121177594447258E-3,-3.1680555419929353,null,null,null,-5.0287171087438036,-2.5143585543719018,-2.6169643933199338,3.2000000000000006,-0.93536563244620785,5.1997450596983432,-1.0198556707552331,-1.8857689157789266]
[null,null,null,null,null,null,null,null,null,null,null,null,null,null,3.4000000000000008,2.0415844445338887,1.2257883308933319E-12,3.1865549427751566E-4,0.95777824447387894,4.1903100030617799E-2,null,null,null,5.8347364626916698E-3,10.259427917480934,5.4105160650546065,1.9674641880235857,1.2985144523064406E-8,3.2948576097043866E-2,0.96663862082689322,4.1279009091847344E-4,null,null,null,0.38646543321818616,1.1593962996545584,0.19323271660909308,3.730481275210341E-3,3.4000000000000008,-11.911507401845244,-3.4966559515305233,-1.8734910705734902E-2,-1.3777449267697293,null,null,null,-2.2339642921843161,10.259427917480934,3.4000000000000008,-7.8865021549085945,-1.4821537535905658,-1.4735761762469135E-2,-3.3842488268231552,null,null,null,-4.9082765342545107,-2.4541382671272554,-2.4282194152016459,3.4000000000000008,-0.95841555546611135,5.4105160650546065,-1.0325358119764143,-1.8406037003454416]
[null,null,null,null,null,null,null,null,null,null,null,null,null,null,3.600000000000001,2.0263363920200486,3.1268114125243648E-12,5.1287037872579206E-4,0.9726378672131194,2.68492624050281E-2,null,null,null,3.8103571939137972E-3,10.422738817578647,5.6215382068211683,1.9477601665946145,3.3627709429357631E-8,5.2488602221647786E-2,0.9472625280789615,2.4883607168127967E-4,null,null,null,0.40153844334436917,1.2046153300331075,0.20076922167218458,5.7645414247467783E-3,3.600000000000001,-11.504823829004481,-3.2899710838920595,-1.2048748269568303E-2,-1.5710574695358599,null,null,null,-2.4190186495937334,10.422738817578647,3.600000000000001,-7.4732543318187545,-1.2799267061123663,-2.3529489895909337E-2,-3.604063330568235,null,null,null,-4.7876924532450467,-2.3938462266225233,-2.2392207387887497,3.600000000000001,-0.97366360797995144,5.6215382068211683,-1.0522398334053855,-1.7953846699668925]
[null,null,null,null,null,null,null,null,null,null,null,null,null,null,3.8000000000000012,2.0162843636216508,7.9303947451187688E-12,8.2073080375396994E-4,0.98207417474705005,1.7105094441265574E-2,null,null,null,2.500184670526769E-3,10.678157336951699,5.8329258111339772,1.9174622352028072,8.6188665796704877E-8,8.2685674803135906E-2,0.91716615662492407,1.480823832743924E-4,null,null,null,0.41663755793814122,1.2499126738144237,0.20831877896907061,8.7567174656308384E-3,3.8000000000000012,-11.100633328766268,-3.0857792888561431,-7.8556584359490544E-3,-1.7668630849045379,null,null,null,-2.602011066457655,10.678157336951699,3.8000000000000012,-7.064504106314244,-1.0825627163997427,-3.7551735975172057E-2,-3.8294718124393841,null,null,null,-4.6668995364948707,-2.3334497682474353,-2.0576453412636426,3.8000000000000012,-0.98371563637834925,5.8329258111339772,-1.0825377647971928,-1.7500873261855763]
[null,null,null,null,null,null,null,null,null,null,null,null,null,null,4.0000000000000009,2.0095474997643561,2.0037116831642475E-11,1.308401877894884E-3,0.98783569641974256,1.0855901682325392E-2,null,null,null,1.6845850296913706E-3,11.071775054733735,6.0448065155412518,1.8720535205379167,2.1738056093123842E-7,0.12803246819676922,0.87188089092686205,8.6423495807762653E-5,null,null,null,0.43177189396723226,1.2953156819016967,0.21588594698361613,1.2868405413269054E-2,4.0000000000000009,-10.698095509744979,-2.8832401750371495,-5.3152498192523788E-3,-1.9643213814901377,null,null,null,-2.7734891073952173,11.071775054733735,4.0000000000000009,-6.6627361601653874,-0.89267410294491334,-5.9542455214370411E-2,-4.0633418643726102,null,null,null,-4.5458248482621419,-2.272912424131071,-1.8904630263889404,4.0000000000000009,-0.99045250023564391,6.0448065155412518,-1.1279464794620833,-1.7046843180983033]
[null,null,null,null,null,null,null,null,null,null,null,null,null,null,4.2000000000000011,2.0047914627721255,5.0494615723314412E-11,2.0804199022272426E-3,0.99104769727193598,6.8718827753421578E-3,null,null,null,1.2139179234339427E-3,11.659035268530715,6.2572748607294768,1.8068252037984842,5.3509044692837525E-7,0.19322275279112436,0.80672768534792638,4.9026770502365288E-5,null,null,null,0.44694820433781979,1.3408446130134593,0.22347410216890989,1.7957060336547325E-2,4.2000000000000011,-10.296688267467989,-2.6818316379624569,-3.9054179468567215E-3,-2.1629102548200394,null,null,null,-2.9157917992722995,11.659035268530715,4.2000000000000011,-6.2715322004083109,-0.71393711285843497,-9.3272434798490594E-2,-4.3095388136273289,null,null,null,-4.4244143652974417,-2.2122071826487208,-1.7457534560370065,4.2000000000000011,-0.9952085372278745,6.2572748607294768,-1.1931747962015158,-1.6591553869865407]
[null,null,null,null,null,null,null,null,null,null,null,null,null,null,4.4000000000000012,2.0010399932665792,1.2700428343322344E-10,3.3015987909822278E-3,0.99235680877044297,4.3415923115704639E-3,null,null,null,9.9712047944265701E-4,12.487507292826194,6.4703073210120445,1.7188523200449657,1.2716666552514027E-6,0.28117188404753601,0.71880009685999691,2.6747425811939599E-5,null,null,null,0.46216480864371745,1.3864944259311525,0.23108240432185873,2.3275731430977956E-2,4.4000000000000012,-9.8961175637184358,-2.4812596394152018,-3.3321246018991097E-3,-2.3623356666773789,null,null,null,-3.0012329337855799,12.487507292826194,4.4000000000000012,-5.8955885481076091,-0.55102454167059978,-0.14339094472352185,-4.5726884046652261,null,null,null,-4.3026815308502604,-2.1513407654251302,-1.6330860899447812,4.4000000000000012,-0.99896000673342078,6.4703073210120445,-1.2811476799550343,-1.6135055740688475]
[null,null,null,null,null,null,null,null,null,null,null,null,null,null,4.6000000000000014,1.9975074971294191,3.1891546092044762E-10,5.2309612459720363E-3,0.99203057942189021,2.7384590132222548E-3,null,null,null,9.9080638235894865E-4,13.560292513284367,6.6836852438660559,1.6100108738685937,2.8829748737135363E-6,0.38999724741704389,0.60998598237269785,1.388723538458785E-5,null,null,null,0.4774060888475754,1.4322182665427263,0.2387030444237877,2.7393766580614137E-2,4.6000000000000014,-9.4962629466925925,-2.2814037275916559,-3.4749179806502642E-3,-2.5624771652584277,null,null,null,-3.0039917566003416,13.560292513284367,4.6000000000000014,-5.5401232757198571,-0.40893581073063834,-0.21467875523135005,-4.8573527566208448,null,null,null,-4.1807512892193968,-2.0903756446096984,-1.5623381345120178,4.6000000000000014,-1.0024925028705809,6.6836852438660559,-1.3899891261314063,-1.5677817334572737]
[null,null,null,null,null,null,null,null,null,null,null,null,null,null,4.8000000000000016,1.9934507534080974,7.9944140687684545E-10,8.2735627860654592E-3,0.99000211862144705,1.7243177930459784E-3,null,null,null,1.192811447342945E-3,14.799194350780454,6.8970304591995308,1.4890155643638556,6.1734437939392155E-6,0.5109789006254688,0.48900811405382505,6.8118769122781682E-6,null,null,null,0.49264503279996646,1.4779350983998996,0.24632251639998323,2.8772206120364838E-2,4.8000000000000016,-9.0971544660595107,-2.0822939521608701,-4.3638477521617302E-3,-2.7633648002322362,null,null,null,-2.9234092753952639,14.799194350780454,4.8000000000000016,-5.2094387754658795,-0.29159514461566094,-0.31068192325537369,-5.166699758783869,null,null,null,-4.0588397376002678,-2.0294198688001339,-1.5410168605405417,4.8000000000000016,-1.0065492465919026,6.8970304591995308,-1.5109844356361444,-1.5220649016001004]
[null,null,null,null,null,null,null,null,null,null,null,null,null,null,5.0000000000000018,1.9880255797749966,1.9997016666730045E-9,1.3057833808568009E-2,0.98585874660876238,1.0834175829679349E-3,null,null,null,1.6410383548674898E-3,16.054576211899985,7.1099804688999608,1.3695062035462746,1.2437709095454271E-5,0.63047207335090227,0.36951233662463473,3.1523153676615626E-6,null,null,null,0.50785574777856868,1.5235672433357057,0.25392787388928434,2.6826194312973339E-2,5.0000000000000018,-8.6989784739756875,-1.8841166652793448,-6.1852660729337268E-3,-2.9651849237553054,null,null,null,-2.7848632390709405,16.054576211899985,5.0000000000000018,-4.9052278484869554,-0.20033284870124937,-0.4323682584054751,-5.5013347249984834,null,null,null,-3.9371540177714506,-1.9685770088857253,-1.5714307604758215,5.0000000000000018,-1.0119744202250034,7.1099804688999608,-1.6304937964537254,-1.4764327566642943]
[null,null,null,null,null,null,null,null,null,null,null,null,null,null,5.200000000000002,1.9801321044788629,4.986930010001384E-9,2.0546563817161297E-2,0.97877475292602456,6.78678269884173E-4,null,null,null,2.4168116769759142E-3,17.173922529036645,7.322349098093679,1.2643611633409697,2.3663593383911099E-5,0.73559289260566874,0.26438206066754083,1.3831334064400469E-6,null,null,null,0.52302493557811991,1.5690748067343598,0.26151246778905995,2.2396361255394993E-2,5.200000000000002,-8.3021129787936712,-1.6872498752996254,-9.3171812955116871E-3,-3.1683155441801807,null,null,null,-2.6167402485529192,17.173922529036645,5.200000000000002,-4.6258893577004523,-0.13336161223639886,-0.57776427626227644,-5.8590979971769368,null,null,null,-3.8158005153750407,-1.9079002576875204,-1.6498118549779257,5.200000000000002,-1.0198678955211371,7.322349098093679,-1.7356388366590303,-1.4309251932656402]
[null,null,null,null,null,null,null,null,null,null,null,null,null,null,5.4000000000000021,1.9682378312133983,1.2380914472153525E-8,3.2185380797812732E-2,0.96739137004823306,4.2323677303982585E-4,null,null,null,3.6498244390078885E-3,18.068469061108772,7.5341386806955644,1.1807491532825616,4.2914539616965067E-5,0.81916559842814651,0.18079090624229457,5.8078994195864928E-7,null,null,null,0.53815276290682601,1.6144582887204781,0.269076381453413,1.7059439539753012E-2,5.4000000000000021,-7.9071960850879517,-1.4923316867962035,-1.4397697994386931E-2,-3.3733947660813528,null,null,null,-2.4377122433103775,18.068469061108772,5.4000000000000021,-4.3673672677147284,-8.6627733729235365E-2,-0.74281860923367315,-6.2359405416268938,null,null,null,-3.6947778967453919,-1.847388948372696,-1.7680237947358548,5.4000000000000021,-1.0317621687866017,7.5341386806955644,-1.8192508467174384,-1.3855417112795219]
[null,null,null,null,null,null,null,null,null,null,null,null,null,null,5.6000000000000023,1.9501865503709845,3.0529500815533627E-8,5.0075538879177768E-2,0.94966228028215738,2.6215030916399611E-4,null,null,null,5.5171228684680121E-3,18.725484058086295,7.7454546772478645,1.1193801890176205,7.5034898705262702E-5,0.88046997708605457,0.11945475211415434,2.3590108578446867E-7,null,null,null,0.55324676266056172,1.6597402879816854,0.27662338133028086,1.2122486638642497E-2,5.6000000000000023,-7.5152316429056443,-1.3003659498161928,-2.2430666216673587E-2,-3.581426439505937,null,null,null,-2.2582727239015274,18.725484058086295,5.6000000000000023,-4.1247099959105986,-5.5285090420070945E-2,-0.92279059441947398,-6.6272271553076596,null,null,null,-3.5740258987155062,-1.7870129493577531,-1.9163958790846263,5.6000000000000023,-1.0498134496290155,7.7454546772478645,-1.8806198109823795,-1.3402597120183146]
[null,null,null,null,null,null,null,null,null,null,null,null,null,null,5.8000000000000025,1.9230472862588528,7.4511488799997335E-8,7.7113278792795698E-2,0.92272593262108915,1.6071407462632645E-4,null,null,null,8.2195093332894965E-3,19.179874857945833,7.9564249462523851,1.0769000771551727,1.278343226303804E-4,0.92284434778393365,7.7027724309069193E-2,9.3584366915390495E-8,null,null,null,0.56831606758945608,1.7049482027683684,0.28415803379472804,8.2048431037867638E-3,5.8000000000000025,-7.1277306138147569,-1.1128636259276024,-3.492704753038018E-2,-3.7939215260219403,null,null,null,-2.0851406077953643,19.179874857945833,5.8000000000000025,-3.8933273199405316,-3.4871317635425239E-2,-1.1133457248202503,-7.0287511888938576,null,null,null,-3.4534714592843514,-1.7267357296421757,-2.0859162149950841,5.8000000000000025,-1.0769527137411472,7.9564249462523851,-1.9230999228448273,-1.2950517972316316]
[null,null,null,null,null,null,null,null,null,null,null,null,null,null,6.0000000000000027,1.8831481730973172,1.7909717429815086E-7,0.11694850169626846,0.88295428621862293,9.7032987934303567E-5,null,null,null,1.1906485329321799E-2,19.48181740444852,8.1671594790759396,1.048643652703463,2.1399388681592814E-4,0.95092839606164814,4.8857573512793163E-2,3.6538742831419421E-8,null,null,null,0.58336853421971002,1.7501056026591297,0.29168426710985501,5.3815843537653365E-3,6.0000000000000027,-6.7468675867427965,-0.93199930405793974,-5.4061430863014778E-2,-4.0130546145568724,null,null,null,-1.9242039614601361,19.48181740444852,6.0000000000000027,-3.6695748760666884,-2.1852042292191488E-2,-1.3110596180076259,-7.4371982506118428,null,null,null,-3.3330517262423198,-1.6665258631211599,-2.2690751579147572,6.0000000000000027,-1.1168518269026828,8.1671594790759396,-1.951356347296537,-1.2498943973408703]
[null,null,null,null,null,null,null,null,null,null,null,null,null,null,6.2000000000000028,1.8265665381519172,4.2108360492353226E-7,0.17348992553675871,0.82645234752375052,5.7305855885876475E-5,null,null,null,1.6519578156927821E-2,19.677734184369911,8.377740060160809,1.0303024016706128,3.5412219194928655E-4,0.96898936806317848,3.0656495627182468E-2,1.4117689770433502E-8,null,null,null,0.59841000429720059,1.7952300128916019,0.2992050021486003,3.471633906682522E-3,6.2000000000000028,-6.3755903919321719,-0.76072081444961248,-8.27816464569847E-2,-4.2417735353531398,null,null,null,-1.7819895103405985,19.677734184369911,6.2000000000000028,-3.4508245155006079,-1.3680899514717135E-2,-1.5134676930187576,-7.8501855434115804,null,null,null,-3.2127199656223953,-1.6063599828111976,-2.4594501560701336,6.2000000000000028,-1.1734334618480828,8.377740060160809,-1.9696975983293872,-1.2047699871083981]
[null,null,null,null,null,null,null,null,null,null,null,null,null,null,6.400000000000003,1.7503941897957942,9.6029028176582784E-7,0.24963671677554203,0.75032949578227637,3.2827151899820646E-5,null,null,null,2.157319282127345E-2,19.803712518478278,8.5882232426729104,1.0185206642117406,5.8167901716658086E-4,0.98031598317199287,1.9102332392773921E-2,5.4180666201952406E-9,null,null,null,0.61344451733377936,1.840333552001338,0.30672225866688968,2.2382327335124085E-3,6.400000000000003,-6.0175585083608913,-0.60268763608062947,-0.12474717329029877,-4.4837377673887513,null,null,null,-1.6660747885651883,19.803712518478278,6.400000000000003,-3.2352956567663207,-8.6338606268253452E-3,-1.7189024739772611,-8.2661021442164806,null,null,null,-3.0924438613297651,-1.5462219306648826,-2.6500776004342632,6.400000000000003,-1.2496058102042058,8.5882232426729104,-1.9814793357882594,-1.159666447998662]
[null,null,null,null,null,null,null,null,null,null,null,null,null,null,6.6000000000000032,1.6547717349262392,2.1048340367088852E-6,0.34524212916643437,0.65473769223878209,1.8073760746896387E-5,null,null,null,2.603014702946637E-2,19.885540132236201,8.7986468997393832,1.010898622812358,9.5092422590682246E-4,0.98719953080614053,1.184954289764013E-2,2.0703124006842728E-9,null,null,null,0.62847477855281308,1.8854243356584395,0.31423738927640654,1.4787070997504916E-3,6.6000000000000032,-5.6767453905831395,-0.46187322350517535,-0.18393146591714199,-4.7429207652178906,null,null,null,-1.5845131206156502,19.885540132236201,6.6000000000000032,-3.0218345248522489,-5.5950234988868868E-3,-1.9262859316354564,-8.6839078966608092,null,null,null,-2.9722017715774953,-1.4861008857887477,-2.830099519782094,6.6000000000000032,-1.3452282650737608,8.7986468997393832,-1.989101377187642,-1.1145756643415605]
[null,null,null,null,null,null,null,null,null,null,null,null,null,null,6.8000000000000034,1.5447548836662093,4.3988588405883458E-6,0.45524580652917329,0.54474030669892259,9.4879130636430419E-6,null,null,null,2.8555746307684936E-2,19.941073826339561,9.0090364657241615,1.0057790851587252,1.549734890864829E-3,0.99112144584836681,7.3288184719469893E-3,7.8882140107183893E-10,null,null,null,0.64350260469458298,1.9305078140837488,0.32175130234729149,1.0486342277095317E-3,6.8000000000000034,-5.3566252953574089,-0.34175183348174154,-0.26380878109600531,-5.0227967855990521,null,null,null,-1.544296487192647,19.941073826339561,6.8000000000000034,-2.8097243988671057,-3.8731014388883817E-3,-2.1349522135006027,-9.1029623824510981,null,null,null,-2.8519791624433362,-1.4259895812216681,-2.9793566824538216,6.8000000000000034,-1.4552451163337907,9.0090364657241615,-1.9942209148412748,-1.0694921859162512]
[null,null,null,null,null,null,null,null,null,null,null,null,null,null,7.0000000000000036,1.4301924557861194,8.7259469511914366E-6,0.56979481994736014,0.43019172647830684,4.7276273818858842E-6,null,null,null,2.8225149844845403E-2,19.982924718351569,9.2194099000282304,1.0020031935470231,2.5201950738495313E-3,0.99295641660521861,4.5233880209913681E-3,2.9994051250968666E-10,null,null,null,0.65852927857344501,1.9755878357203349,0.3292646392867225,8.5963164607495202E-4,7.0000000000000036,-5.0591546784839867,-0.24427992181061692,-0.36633557462717792,-5.3253222843325219,null,null,null,-1.5493537132024715,19.982924718351569,7.0000000000000036,-2.5985490185864126,-3.0697935070667956E-3,-2.3445209779176519,-9.5229032192170191,null,null,null,-2.7317657714124399,-1.36588288570622,-3.0656677577472404,7.0000000000000036,-1.5698075442138806,9.2194099000282304,-1.9979968064529769,-1.0244121642796651]
[null,null,null,null,null,null,null,null,null,null,null,null,null,null,7.2000000000000037,1.3226446007740214,1.6439591500085179E-5,0.6773247573299459,0.32265656579158708,2.2372869670326764E-6,null,null,null,2.5166049601100606E-2,20.020832466252614,9.4297815209616029,0.99869571970784365,4.0914563177732325E-3,0.993121367770468,2.7871757979005991E-3,1.138581248088399E-10,null,null,null,0.67355582292582883,2.0206674687774862,0.33677791146291441,8.7154513970799164E-4,7.2000000000000037,-4.7840780059809118,-0.16920195450983874,-0.49125631252869695,-5.6502417274363381,null,null,null,-1.5991745986525807,20.020832466252614,7.2000000000000037,-2.3881066205113122,-2.9976544218808885E-3,-2.554819097822381,-9.9435715981116637,null,null,null,-2.6115534165933694,-1.3057767082966847,-3.0596903061435565,7.2000000000000037,-1.6773553992259786,9.4297815209616029,-2.0013042802921563,-0.97933253122251385]
[null,null,null,null,null,null,null,null,null,null,null,null,null,null,7.4000000000000039,1.2310708889305968,2.9576551439537302E-5,0.76887096902949703,0.23109844335609106,1.0110629725349097E-6,null,null,null,2.0463873874287952E-2,20.063731157279108,9.6401651822701666,0.99508288805634781,6.6316159806792232E-3,0.9916538800254413,1.7145039507321528E-3,4.3147386360084171E-11,null,null,null,0.68858322730501187,2.0657496819150358,0.34429161365250593,1.0876454539105217E-3,7.4000000000000039,-4.5290231441293436,-0.11414579786056804,-0.63619886108172352,-5.9951829811916619,null,null,null,-1.6890012149143372,20.063731157279108,7.4000000000000039,-2.1783665277619018,-3.6398609596274174E-3,-2.7658436036472844,-10.364978403223724,null,null,null,-2.491334181559905,-1.2456670907799525,-2.9634934653100613,7.4000000000000039,-1.7689291110694032,9.6401651822701666,-2.0049171119436524,-0.93425031808496417]
[null,null,null,null,null,null,null,null,null,null,null,null,null,null,7.6000000000000041,1.1593551641220443,5.1245283076373541E-5,0.84054278534411397,0.15940552934049843,4.4003231113534503E-7,null,null,null,1.5436096985723404E-2,20.121755062427837,9.8505773086917063,0.99032434643730838,1.0728147538950033E-2,0.98821935850110809,1.0524939436255651E-3,1.6316367645812227E-11,null,null,null,0.7036126649065505,2.1108379947196516,0.35180633245327525,1.5558154696508929E-3,7.6000000000000041,-4.2903183278535764,-7.5439686787097823E-2,-0.79749145521055054,-6.3564742805227858,null,null,null,-1.8114507740119825,20.121755062427837,7.6000000000000041,-1.969462512116207,-5.1466095297824114E-3,-2.9777611164332889,-10.787306680225578,null,null,null,-2.371098680747596,-1.185549340373798,-2.808023735354801,7.6000000000000041,-1.8406448358779557,9.8505773086917063,-2.0096756535626916,-0.88916200528034839]
[null,null,null,null,null,null,null,null,null,null,null,null,null,null,7.8000000000000043,1.106775371172936,8.6292078788865792E-5,0.8930522307931541,0.10686129100438926,1.8612366781933033E-7,null,null,null,1.1002284535478643E-2,20.208536063728388,10.061040246754805,0.98333543685100366,1.730878520362935E-2,0.98204699274788931,6.4422204232995699E-4,6.1514361314731565E-12,null,null,null,0.71864573191105752,2.1559371957331726,0.35932286595552876,2.3763685402740731E-3,7.8000000000000043,-4.0640027581893738,-4.9122822325192696E-2,-0.97117329595094248,-6.7301548264654754,null,null,null,-1.9585044483209444,20.208536063728388,7.8000000000000043,-1.7617220060515231,-7.8676789935534872E-3,-3.1909437614255154,-11.21095090074626,null,null,null,-2.2508341447115399,-1.1254170723557699,-2.6240692173920874,7.8000000000000043,-1.893224628827064,10.061040246754805,-2.0166645631489963,-0.84406280426682745]
[null,null,null,null,null,null,null,null,null,null,null,null,null,null,8.0000000000000036,1.0700471801528715,1.4237116091243458E-4,0.92966815466051922,7.0189397043352877E-2,7.7135215522781146E-8,null,null,null,7.5354301924875139E-3,20.344214436772745,10.271586190317612,0.9725791581026616,2.7813424980569434E-2,0.97179399193850791,3.9258307861417919E-4,2.308482420943144E-12,null,null,null,0.73368472787982941,2.2010541836394881,0.36684236393991471,3.715191685370729E-3,8.0000000000000036,-3.8465530709541502,-3.1671840292264788E-2,-1.1537210191203109,-7.1127012548371402,null,null,null,-2.1228782054925031,20.344214436772745,8.0000000000000036,-1.555735456388589,-1.2425709821405263E-2,-3.4060463727441528,-11.636598092555683,null,null,null,-2.1305221769613647,-1.0652610884806823,-2.4300030419813896,8.0000000000000036,-1.9299528198471285,10.271586190317612,-2.0274208418973383,-0.79894581636051187]
[null,null,null,null,null,null,null,null,null,null,null,null,null,null,8.2000000000000028,1.0452287239954827,2.3162352342425102E-4,0.95430806047963734,4.5460284474969546E-2,3.1521968791778234E-8,null,null,null,5.0297297396036458E-3,20.55962798622204,10.482261360601155,0.9558238601100314,4.4413738611536378E-2,0.95534866266775598,2.3759871984755442E-4,8.6012965539946597E-13,null,null,null,0.74873295432865394,2.2461988629859619,0.37436647716432697,5.8165597775786722E-3,8.2000000000000028,-3.6351938018908609,-2.0311276431271709E-2,-1.3423591604616143,-7.5013381013807399,null,null,null,-2.2984404699101217,20.55962798622204,8.2000000000000028,-1.3524739117602842,-1.9837971568011533E-2,-3.6241324408656705,-12.06535796705211,null,null,null,-2.0101363653707685,-1.0050681826853842,-2.2353193327187371,8.2000000000000028,-1.9547712760045173,10.482261360601155,-2.0441761398899687,-0.75380113701403806]
[null,null,null,null,null,null,null,null,null,null,null,null,null,null,8.4000000000000021,1.0287956243558241,3.7331093522827272E-4,0.97045776653520954,2.9168909768072241E-2,1.2761489946631655E-8,null,null,null,3.313200452824289E-3,20.902049214055296,10.693128606202979,0.92991090841498747,7.0231364877945623E-2,0.92962636182943836,1.4227329229914547E-4,3.1693920261516443E-13,null,null,null,0.76379490044306997,2.2913847013292101,0.38189745022153498,8.9999527839548198E-3,8.4000000000000021,-3.42790709592082,-1.3023275663527704E-2,-1.5350698648961667,-7.8940475110175878,null,null,null,-2.4797362340690454,20.902049214055296,8.4000000000000021,-1.1534614238684855,-3.1691364125910462E-2,-3.8468517138732667,-12.498943120509406,null,null,null,-1.8896407964554403,-0.94482039822772013,-2.045746524748945,8.4000000000000021,-1.9712043756441759,10.693128606202979,-2.0700890915850128,-0.70861529867078987]
[null,null,null,null,null,null,null,null,null,null,null,null,null,null,8.6000000000000014,1.0180025491195841,5.9796422975356425E-4,0.98080152755549987,1.8600503080155279E-2,5.1345912481854244E-9,null,null,null,2.1848262778641201E-3,21.442285725788679,10.904263374595613,0.890687866722077,0.10939594870769613,0.89052023586264561,8.381542954346015E-5,1.1482640976917698E-13,null,null,null,0.77887595532825815,2.3366278659847741,0.38943797766412908,1.3608282585501376E-2,8.6000000000000014,-3.2233039269818167,-8.4188119268200669E-3,-1.7304641063617552,-8.2894404576854726,null,null,null,-2.6605658648022894,21.442285725788679,8.6000000000000014,-0.96099253956496733,-5.035588133096084E-2,-4.0766496325868857,-12.939874440731593,null,null,null,-1.7689923573739348,-0.88449617868696739,-1.8661845991374406,8.6000000000000014,-1.9819974508804159,10.904263374595613,-2.109312133277923,-0.66337213401522588]
[null,null,null,null,null,null,null,null,null,null,null,null,null,null,8.8000000000000007,1.0108591621796201,9.5392390497511901E-4,0.98723299206795134,1.1813081969552013E-2,2.0575215999712446E-9,null,null,null,1.4750117581534686E-3,22.281442677194718,11.115733453073027,0.83345430369094209,0.16659389571259955,0.8333579048838996,4.8199403460318842E-5,4.0577883955737625E-14,null,null,null,0.79398096093378767,2.3819428828013627,0.39699048046689384,1.9864405427772912E-2,8.8000000000000007,-3.0204667132260674,-5.5803033733675582E-3,-1.9276243030105991,-8.6865993595366131,null,null,null,-2.8311861884793958,22.281442677194718,8.8000000000000007,-0.77833587696570172,-7.9167928154249348E-2,-4.3169303888327279,-13.391623906399989,null,null,null,-1.6481523125296986,-0.82407615626484931,-1.7019134112771221,8.8000000000000007,-1.9891408378203799,11.115733453073027,-2.1665456963090577,-0.61805711719863732]
[null,null,null,null,null,null,null,null,null,null,null,null,null,null,9,1.0059643590050169,1.5176369346641891E-3,0.99100036794789437,7.4819942952013959E-3,8.222399205739279E-10,null,null,null,1.0616998013731854E-3,23.553723619261291,11.327553158845967,0.75442460377135589,0.2456021863941559,0.75437102344034646,2.6790165483948131E-5,1.3848521930202158E-14,null,null,null,0.80911093991756911,2.4273328197527073,0.40455546995878455,2.7642617596644499E-2,9,-2.8188138634981055,-3.9261588477017819E-3,-2.1259688636872296,-9.0849426254155397,null,null,null,-2.9739790102616657,23.553723619261291,9,-0.60976382371772753,-0.12241420936087337,-4.5719950044939504,-13.85850685651581,null,null,null,-1.5271124806594472,-0.76355624032972358,-1.5584107449663964,9,-1.9940356409949831,11.327553158845967,-2.2455753962286442,-0.57266718024729268]
[null,null,null,null,null,null,null,null,null,null,null,null,null,null,9.1999999999999993,1.0023198737902235,2.4098072685543978E-3,0.99286051200062175,4.7296804028698278E-3,3.2795403675143606E-10,null,null,null,8.6836671180764188E-4,25.425947584153619,11.539624057245398,0.65338334854214952,0.34663089010190618,0.65335487125404246,1.4238644046759861E-5,4.5167469670538582E-15,null,null,null,0.82425886123181413,2.4727765836954423,0.41212943061590707,3.6354060271112647E-2,9.1999999999999993,-2.6180007410021977,-3.111741554090532E-3,-2.3251531515959147,-9.4841256185265213,null,null,null,-3.0612770144540971,25.425947584153619,9.1999999999999993,-0.46012975873777456,-0.18484966983579007,-4.8464999904237365,-14.345081367900466,null,null,null,-1.4059291101454869,-0.70296455507274347,-1.4394377581419544,9.1999999999999993,-1.9976801262097765,11.539624057245398,-2.3466166514578504,-0.52722341630455771]
[null,null,null,null,null,null,null,null,null,null,null,null,null,null,9.3999999999999986,0.99916465906032204,3.8205707480714248E-3,0.9931941995741399,2.9852295471840063E-3,1.3060473345656519E-10,null,null,null,8.5798658733276796E-4,28.122492051625159,11.751718173325493,0.53632026280259038,0.46368690915931121,0.53630591887878865,7.171961898785251E-6,1.3960500420025606E-15,null,null,null,0.83940844095182088,2.518225322855463,0.41970422047591044,4.5379988512943843E-2,9.3999999999999986,-2.4178561005100265,-2.9658062642157344E-3,-2.5250059215083365,-9.8839770936412386,null,null,null,-3.0664996486918232,28.122492051625159,9.3999999999999986,-0.33377300410619953,-0.27058565818943875,-5.1443287217626095,-14.855002842224563,null,null,null,-1.284732472385433,-0.64236623619271649,-1.3431269229396519,9.3999999999999986,-2.0008353409396777,11.751718173325493,-2.4636797371974097,-0.48177467714453703]
[null,null,null,null,null,null,null,null,null,null,null,null,null,null,9.5999999999999979,0.99583307695187606,6.0483441063189178E-3,0.99207023488742163,1.881420954323485E-3,5.1935840254388812E-11,null,null,null,1.0290521629532994E-3,32.065280988172162,11.963554366049292,0.41526219743916726,0.58474121216887731,0.41525537822307884,3.4096080435792799E-6,4.0750343744267386E-16,null,null,null,0.85453959757494946,2.5636187927248484,0.42726979878747473,5.523328548968038E-2,9.5999999999999979,-2.2183491469805219,-3.457557937007636E-3,-2.7254963783834243,-10.284466255718623,null,null,null,-2.9875432687200183,32.065280988172162,9.5999999999999979,-0.23303478762559407,-0.38168226300755415,-5.4672601478794451,-15.38976908964012,null,null,null,-1.1636832194004043,-0.58184160970020216,-1.2577909795135389,9.5999999999999979,-2.0041669230481238,11.963554366049292,-2.5847378025608325,-0.43638120727515162]
[null,null,null,null,null,null,null,null,null,null,null,null,null,null,9.7999999999999972,0.99162492993690565,9.558800759507791E-3,0.98925746856469599,1.183730655178713E-3,2.0617408715658796E-11,null,null,null,1.4158831559157431E-3,38.31748273660196,12.174908797581793,0.30387243327183067,0.69612910036199671,0.30386936600417597,1.533633827144236E-6,1.1266630909495503E-16,null,null,null,0.86963634268441381,2.6089090280532412,0.43481817134220691,6.8730051464283209E-2,9.7999999999999972,-2.0195835157446624,-4.6906319034443382E-3,-2.9267281575521573,-10.685696740089654,null,null,null,-2.848954140590628,38.31748273660196,9.7999999999999972,-0.15730919257483819,-0.51730973118313639,-5.8142406792813661,-15.948102684268379,null,null,null,-1.0429092585246895,-0.52145462926234476,-1.1628458025969262,9.7999999999999972,-2.0083750700630945,12.174908797581793,-2.6961275667281694,-0.39109097194675879]
[null,null,null,null,null,null,null,null,null,null,null,null,null,null,9.9999999999999964,0.98567105712219227,1.5071996722906525E-2,0.98418494944016033,7.4305382876725494E-4,8.1658512027948545E-12,null,null,null,2.0937939301416968E-3,49.999999998544808,12.385643935645515,0.21179059338548806,0.78821006458072074,0.21178927745307055,6.5796620871604737E-7,2.9753690426844751E-17,null,null,null,0.88468885254610818,2.6540665576383242,0.44234442627305409,9.1310450241663066E-2,9.9999999999999964,-1.8218174144781514,-6.9232358392294574E-3,-3.1289594666902389,-11.087926754430031,null,null,null,-2.6790487192959236,49.999999998544808,9.9999999999999964,-0.10335735483066054,-0.67409166720581704,-6.1817563890709053,-16.526352167824776,null,null,null,-0.92248917963113453,-0.46124458981556726,-1.0394727861778328,9.9999999999999964,-2.0143289428778077,12.385643935645515,-2.788209406614512,-0.34593344236167578]
[null,null,null,null,null,null,null,null,null,null,null,null,null,null,10.199999999999996,0.97677966190913523,2.3685202823609631E-2,0.97584993244686868,4.6486472629832487E-4,3.2233523313833998E-12,null,null,null,3.1884721452273466E-3,null,null,null,null,null,null,null,null,null,null,null,null,null,null,10.199999999999996,-1.6255123683075723,-1.061689487094657E-2,-3.3326518309242523,-11.49161782386634,null,null,null,-2.4964012109174858,null,10.199999999999996,null,null,null,null,null,null,null,null,null,null,10.199999999999996,-2.0232203380908649,9.6150132080608657,-2.0044429320761092]
[null,null,null,null,null,null,null,null,null,null,null,null,null,null,10.399999999999995,0.96325749519364512,3.7031855791726936E-2,0.96267879322416694,2.8935098284026221E-4,1.2659196685526628E-12,null,null,null,4.8865028458402234E-3,null,null,null,null,null,null,null,null,null,null,null,null,null,null,10.399999999999995,-1.4314152564117639,-1.6518488177434561E-2,-3.5385521294330369,-11.897516827577421,null,null,null,-2.3109868825663575,null,10.399999999999995,null,null,null,null,null,null,null,null,null,null,10.399999999999995,-2.0367425048063548,9.7279523370667196,-2.0067086239103911]
[null,null,null,null,null,null,null,null,null,null,null,null,null,null,10.599999999999994,0.94272546418019187,5.7453252095010378E-2,0.94236803163028049,1.7871627421570579E-4,4.9333881645131508E-13,null,null,null,7.438465095029591E-3,null,null,null,null,null,null,null,null,null,null,null,null,null,null,10.599999999999994,-1.2406773512080227,-2.5779288175989661E-2,-3.7478116346338881,-12.306775037980568,null,null,null,-2.1285028905812258,null,10.599999999999994,null,null,null,null,null,null,null,null,null,null,10.599999999999994,-2.0572745358198081,9.9401436011226583,-2.0123011633473658]
[null,null,null,null,null,null,null,null,null,null,null,null,null,null,10.799999999999994,0.91200662160559731,8.8102481629514895E-2,0.91178841513556308,1.0910323473208167E-4,1.9002853164533453E-13,null,null,null,1.1136071889972565E-2,null,null,null,null,null,null,null,null,null,null,null,null,null,null,10.799999999999994,-1.0550050282770729,-4.010567044733615E-2,-3.9621367221075308,-12.721098830656508,null,null,null,-1.9532553286606473,null,10.799999999999994,null,null,null,null,null,null,null,null,null,null,10.799999999999994,-2.0879933783944029,10.080207131362924,-2.0174602283519465]
[null,null,null,null,null,null,null,null,null,null,null,null,null,null,10.999999999999993,0.86727011480118732,0.13279535369514844,0.86713917780858774,6.5468496191826997E-5,7.1947142680111086E-14,null,null,null,1.6234447597023374E-2,null,null,null,null,null,null,null,null,null,null,null,null,null,null,10.999999999999993,-0.87681144349309437,-6.191079086565409E-2,-4.1839405477281453,-13.142901361479419,null,null,null,-1.789550898742132,null,10.999999999999993,null,null,null,null,null,null,null,null,null,null,10.999999999999993,-2.1327298851988128,10.190614989439691,-2.0227151125874938]
[null,null,null,null,null,null,null,null,null,null,null,null,null,null,11.199999999999992,0.80473647084949662,0.19530186065511448,0.80465980784030089,3.8331504557983186E-5,2.6578902978136064E-14,null,null,null,2.2801366917055674E-2,null,null,null,null,null,null,null,null,null,null,null,null,null,null,11.199999999999992,-0.7092890271783906,-9.4387079753246672E-2,-4.4164155418180338,-13.575375060771604,null,null,null,-1.6420284861966383,null,11.199999999999992,null,null,null,null,null,null,null,null,null,null,11.199999999999992,-2.1952635291505036,10.37236083758977,-2.0345183164431271]
[null,null,null,null,null,null,null,null,null,null,null,null,null,null,11.399999999999991,0.72221881395640797,0.27780289236597144,0.72217540131165869,2.1706322360415026E-5,9.4965844381332886E-15,null,null,null,3.0553630750289672E-2,null,null,null,null,null,null,null,null,null,null,null,null,null,null,11.399999999999991,-0.55625963564298297,-0.1413563934201352,-4.6633835606872189,-14.022341784843087,null,null,null,-1.5149273665694651,null,11.399999999999991,null,null,null,null,null,null,null,null,null,null,11.399999999999991,-2.2777811860435921,10.497270557538844,-2.0456750144695195]
[null,null,null,null,null,null,null,null,null,null,null,null,null,null,11.599999999999991,0.62126200054383174,0.3787497809911185,0.62123843747393459,1.17815349437159E-5,3.2522435523120755E-15,null,null,null,3.8901944703044415E-2,null,null,null,null,null,null,null,null,null,null,null,null,null,null,11.599999999999991,-0.42164487987492255,-0.20674034285437121,-4.9287662153237513,-14.487723144681913,null,null,null,-1.4100195592986766,null,11.599999999999991,null,null,null,null,null,null,null,null,null,null,11.599999999999991,-2.3787379994561682,10.613792698213821,-2.0590249573194104]
[null,null,null,null,null,null,null,null,null,null,null,null,null,null,11.79999999999999,0.50858877596904672,0.49141730958235946,0.50857660486623535,6.0855514041288533E-6,1.0599396071240158E-15,null,null,null,4.7492454760874082E-2,null,null,null,null,null,null,null,null,null,null,null,null,null,null,11.79999999999999,-0.30854755254065785,-0.2936417207224028,-5.2156662983940798,-14.974621932954539,null,null,null,-1.323366814773985,null,11.79999999999999,null,null,null,null,null,null,null,null,null,null,11.79999999999999,-2.4914112240309532,10.786071818236332,-2.0854464276697278]
[null,null,null,null,null,null,null,null,null,null,null,null,null,null,11.999999999999989,0.39504011808192208,0.60496286440262215,0.39503415311283407,2.9824845434925367E-6,3.2776259342073192E-16,null,null,null,5.7179367525627023E-2,null,null,null,null,null,null,null,null,null,null,null,null,null,null,11.999999999999989,-0.21826987057582137,-0.40336274395986266,-5.5253860268338348,-15.484340366596591,null,null,null,-1.2427526071662254,null,11.999999999999989,null,null,null,null,null,null,null,null,null,null,11.999999999999989,-2.6049598819180781,10.930590394798498,-2.1153656412027981]
[null,null,null,null,null,null,null,null,null,null,null,null,null,null,12.199999999999989,0.29179122245083511,0.70821016753905941,0.29178844247104618,1.3899898943089273E-6,9.6381310797602333E-17,null,null,null,7.0806926153434244E-2,null,null,null,null,null,null,null,null,null,null,null,null,null,null,12.199999999999989,-0.14983687246249119,-0.53492845104882891,-5.8569504391250975,-16.015903484090149,null,null,null,-1.149916814054246,null,12.199999999999989,null,null,null,null,null,null,null,null,null,null,12.199999999999989,-2.708208777549165,11.115307824974309,-2.1664096079670498]
[null,null,null,null,null,null,null,null,null,null,null,null,null,null,12.399999999999988,0.20632489639774698,0.79367572374630424,0.20632365610964459,6.2014405114896231E-7,2.7131497670384811E-17,null,null,null,9.3367151729144296E-2,null,null,null,null,null,null,null,null,null,null,null,null,null,null,12.399999999999988,-0.10035625359870899,-0.68544653738734296,-6.207467230665908,-16.566418980833255,null,null,null,-1.0297992226852899,null,12.399999999999988,null,null,null,null,null,null,null,null,null,null,12.399999999999988,-2.7936751036022529,11.228738052510218,-2.2058764968277997]
[null,null,null,null,null,null,null,null,null,null,null,null,null,null,12.599999999999987,0.14091127091902761,0.85908899631246771,0.14091073645603708,2.6723149524552903E-7,7.3768139002173107E-18,null,null,null,0.13203373475581767,null,null,null,null,null,null,null,null,null,null,null,null,null,null,12.599999999999987,-6.5961416576819976E-2,-0.85105040556775013,-6.573069804048612,-17.132020259418255,null,null,null,-0.87930939925098861,null,12.599999999999987,null,null,null,null,null,null,null,null,null,null,12.599999999999987,-2.8590887290809723,11.387747940853057,-2.2721558390714005]
[null,null,null,null,null,null,null,null,null,null,null,null,null,null,12.799999999999986,9.3785956013772473E-2,0.90621415620882773,9.3785731568571895E-2,1.1222260028742242E-7,1.9546162863464389E-18,null,null,null,0.19695540486637989,null,null,null,null,null,null,null,null,null,null,null,null,null,null,12.799999999999986,-4.2768880988888119E-2,-1.0278565751821147,-6.9498746788652737,-17.708823839437212,null,null,null,-0.70562752849241495,null,12.799999999999986,null,null,null,null,null,null,null,null,null,null,12.799999999999986,-2.9062140439862274,11.540056868439935,-2.3468424143618356]
[null,null,null,null,null,null,null,null,null,null,null,null,null,null,12.999999999999986,6.1296415927851206E-2,0.9387036303505113,6.1296323371126379E-2,4.6278362411639003E-8,5.0857987232152105E-19,null,null,null,0.3032696874017477,null,null,null,null,null,null,null,null,null,null,null,null,null,null,12.999999999999986,-2.7471324686481727E-2,-1.2125577240820047,-7.3345745329674594,-18.293522398741693,null,null,null,-0.51816764175605601,null,12.999999999999986,null,null,null,null,null,null,null,null,null,null,12.999999999999986,-2.9387035840721487,11.669389370821216,-2.4169955710844651]
[null,null,null,null,null,null,null,null,null,null,null,null,null,null,13.199999999999985,3.9570526588397291E-2,0.96042949226175967,3.9570488888083184E-2,1.8850157052659E-8,1.3070619095250562E-19,null,null,null,0.47452643184760263,null,null,null,null,null,null,null,null,null,null,null,null,null,null,13.199999999999985,-1.7534398851584861E-2,-1.4026195034494042,-7.7246350175371541,-18.883581588513689,null,null,null,-0.32373749581003769,null,13.199999999999985,null,null,null,null,null,null,null,null,null,null,13.199999999999985,-2.9604294734116028,11.817897542731922,-2.5017135126713206]
[null,null,null,null,null,null,null,null,null,null,null,null,null,null,13.399999999999984,2.5337311671560211E-2,0.97466269594403465,2.5337296440370579E-2,7.6155948164003231E-9,3.3318467320124258E-20,null,null,null,0.74798220973199625,null,null,null,null,null,null,null,null,null,null,null,null,null,null,13.399999999999984,-1.1145583565406543E-2,-1.5962293933655221,-8.1182436126555686,-19.477188888834398,null,null,null,-0.12610791499663515,null,13.399999999999984,null,null,null,null,null,null,null,null,null,null,13.399999999999984,-2.9746626883284399,11.957715683302158,-2.5814695549447997]
[null,null,null,null,null,null,null,null,null,null,null,null,null,null,13.599999999999984,1.6137655257964671E-2,0.98386234780247495,1.6137649137085288E-2,3.0604396919013453E-9,8.4482160455121434E-21,null,null,null,1.1827937293584514,null,null,null,null,null,null,null,null,null,null,null,null,null,null,13.599999999999984,-7.0656137236618519E-3,-1.7921481287260734,-8.514161053218416,null,null,null,null,7.2908541413623754E-2,null,13.599999999999984,null,null,null,null,null,null,null,null,null,null,13.599999999999984,-2.9838623447420352,12.133749346690092,-2.6757153749454692]
[null,null,null,null,null,null,null,null,null,null,null,null,null,null,13.799999999999983,1.0243173726719646E-2,0.98975682749896277,1.0243171275354611E-2,1.2256825174619056E-9,2.1348097481124492E-21,null,null,null,1.8728718471547081,null,null,null,null,null,null,null,null,null,null,null,null,null,null,13.799999999999983,-4.4714647850776111E-3,-1.9895526849897858,-8.9115643146844246,null,null,null,null,0.27250629720940811,null,13.799999999999983,null,null,null,null,null,null,null,null,null,null,13.799999999999983,-2.9897568262732803,12.253787600922712,-2.7331282501560308]
[null,null,null,null,null,null,null,null,null,null,null,null,null,null,13.999999999999982,6.4875290717873058E-3,0.99351247141801713,6.4875280921782219E-3,4.8980454241557239E-10,5.3827473286212253E-22,null,null,null,2.9671939901579969,null,null,null,null,null,null,null,null,null,null,null,null,null,null,13.999999999999982,-2.8266585844067115E-3,-2.1879065839914111,-9.3099169188883462,null,null,null,null,0.47234288272642883,null,13.999999999999982,null,null,null,null,null,null,null,null,null,null,13.999999999999982,-2.9935124709282128,12.370424149452386,-2.7823000534861997]

{"sheet":"Analise_I","index":6,"n_rows":306,"n_cols":23,"rows_kept":306,"cut":false,"hidden":false,"merged":[]}
[null,null,"    Análise de Dados de Curvas de Titulação Reais ou Simuladas  I – método das derivadas",null,null,null,null,null,null,null,null,null,null,null,"<--- leia instruções",null,null,null,null,null,"código de cores"]
["     Interpolação de dados com alisamento por spline",null,null,null,null,null,null,"Intensidade do alisamento      ",null,"   Intervalo a analisar",null,null,"Estatísticas do ajuste",null,null,null,"Localizador de inflexões com base nas derivadas",null,null,null,"N ã o   a l t e r e"]
[null,null,null,null,null,null,null,"(0 a 100%)",85,"Volume inicial",0,null,"Desv. Padrão, spH",8.5396420668070364E-2,null,"Limiar de detecção |dpH/dV| >",1,"sugestão ",0.38695946908090278,"     P r e e n c h a   o u   m o d i f i q u e "]
[null,null,null,null,null,null,null,"nº ptos. interpolados",300,"Volume final",49.999999998544808,null,"Coefic. de correl., R",0.99956844021720814,null,null,"Detecção de pontos de inflexão",null,null,null,null,"Dados interpolados e alisados"]
["Volume","pH","pH ajust.","dpH/dV",null,null,null,null,null,null,null,null,null,null,"ponto","Volume","pH","dpH/dV","d2pH/dV2","Vol. Interp. ","pH ajust","dpH/dV","d2pH/dV2"]
[0,2.2482361616632276,2.2477912303889083,4.4394079910987393E-2,null,null,null,null,null,null,null,null,null,null,1,10.047833361532291,4.6069860909514464,1.8216420994200988,1.2228618118471162E-3,0,2.2477912303889083,4.438840152905367E-2,0]
[2.1441188422613777,2.3647922005853386,2.3653543093932039,7.6443676588939719E-2,null,null,null,null,null,null,null,null,null,null,2,30.01250000066441,9.3392150292822347,1.8869309236622829,-3.4716549636060268E-3,0.16666666666181604,2.2551998129407687,4.4577872352090181E-2,1.1356915408639271E-3]
[4.004995925060939,2.5506499922129273,2.5529887795508976,0.12440848293731632,null,null,null,null,null,null,null,null,null,null,3,null,null,null,null,0.33333333332363208,2.2626714893403927,4.514590626534639E-2,2.2713830817486708E-3]
[5.5376416989020072,2.7350617167038536,2.7241842697076466,6.785983666046537E-2,null,null,null,null,null,null,null,null,null,null,4,null,null,null,null,0.49999999998544808,2.2702693534355443,4.6092503263493213E-2,3.4070746226334148E-3]
[6.745316281740088,2.8001589143336103,2.8168921085253715,0.15152556009756529,null,null,null,null,null,null,null,null,null,null,5,null,null,null,null,0.66666666664726415,2.2780564990739869,4.7417663346530657E-2,4.5427581698915644E-3]
[7.6638402344542556,3.0210089771607134,3.0105489912522088,0.23935895754652789,null,null,null,null,null,null,null,null,null,null,6,null,null,null,null,0.83333333330908022,2.2860960201034839,4.9121386519787792E-2,5.6784577043820861E-3]
[8.3438355490216054,3.2059162355606015,3.1735117715601051,0.24585077064987898,null,null,null,null,null,null,null,null,null,null,7,null,null,null,null,0.99999999997089617,2.2944510103717999,5.1203672775271013E-2,6.8141332580552742E-3]
[8.8374652448692359,3.3224174642237614,3.3191185459523194,0.40254228756618149,null,null,null,null,null,null,null,null,null,null,8,null,null,null,null,1.1666666666327123,2.3031845637266972,5.3664522120973918E-2,7.9498327925249784E-3]
[9.1911136594717391,3.5577328532705077,3.4994963911690729,0.68128674965399272,null,null,null,null,null,null,null,null,null,null,9,null,null,null,null,1.3333333332945283,2.3123597740159409,5.650393455156745E-2,9.0855163398039455E-3]
[9.4426845156704076,3.6543097997180687,3.702783938622709,1.0343538347538883,null,null,null,null,null,null,null,null,null,null,10,null,null,null,null,1.4999999999563443,2.3220397350872939,5.9721910067051596E-2,1.0221191893477134E-2]
[9.6216144142090343,3.7902703812451346,3.9087827748667299,1.3673466497569156,null,null,null,null,null,null,null,null,null,null,11,null,null,null,null,1.6666666666181604,2.3322875407885197,6.3318448672755434E-2,1.1356891427946839E-2]
[9.7501260883291252,3.9695198921904384,4.093756388175696,1.5931835522330977,null,null,null,null,null,null,null,null,null,null,12,null,null,null,null,1.8333333332799764,2.3431662849673827,6.7293550363349885E-2,1.2492574975225806E-2]
[9.8448491291492246,4.2963445528630579,4.2476246848804697,1.7123901295921333,null,null,null,null,null,null,null,null,null,null,13,null,null,null,null,1.9999999999417923,2.3547390614716459,7.1647215138834958E-2,1.3628258522463138E-2]
[9.9183949307189323,4.4234688315192683,4.37437211645784,1.7748851492560465,null,null,null,null,null,null,null,null,null,null,14,null,null,null,null,2.1666666666036085,2.3670689312539968,7.63750338648196E-2,1.4569841334252029E-2]
[9.9807470614905469,4.3161688355486536,4.485300612834406,1.8114455126765505,null,null,null,null,null,null,null,null,null,null,15,null,null,null,null,2.3333333332654247,2.3801996475684373,8.1181752189660866E-2,1.4270760574085604E-2]
[10.040469448722433,4.3549548393368696,4.5935727403477191,1.8176462791875643,null,null,null,null,null,null,null,null,null,null,null,null,"Cálculo de concentrações no titulado",null,null,2.4999999999272404,2.3941231836829133,8.5888771766575181E-2,1.3971647839496067E-2]
[10.105798782024067,4.8580520113807184,4.7120782207504153,1.7687521014919825,null,null,null,null,null,null,null,null,null,null,null,null,"(opcional e modificável)",null,null,2.6666666665890566,2.4088229231402556,9.0496092603556164E-2,1.3672559085682229E-2]
[10.185713412647601,5.1357991946662338,4.8517876304261467,1.6437152120890819,null,null,null,null,null,null,null,null,null,null,null,null,"Presume-se titulante monoprótico",null,null,2.8333333332508728,2.4242822494832952,9.5003714697939279E-2,1.337346233830425E-2]
[10.291077989677433,5.1329008521350588,5.0194538449700117,1.4393694924113245,null,null,null,null,null,null,null,null,null,null,null,null,"Volume de titulado (pipetado na célula)  ",20,"  mL",2.9999999999126885,2.4404845462548628,9.9411638049724527E-2,1.3074373584532046E-2]
[10.435955300636124,5.2423833602130161,5.2146492768169725,1.1641204134540271,null,null,null,null,null,null,null,null,null,null,null,null,"Concentração do titulante (na bureta)  ",0.1,"  mol/L",3.1666666665745047,2.4574131969977904,0.10371986265624737,1.2775276837154065E-2]
[10.639140704006422,5.4344364742158016,5.4251033055535851,0.84111876904719718,null,null,null,null,null,null,null,null,null,null,null,null,"  Número de mols - titulante",null,"Result.(mol/L)",3.3333333332363209,2.4750515852549082,0.10792838852017235,1.2476180089734451E-2]
[10.925871347717475,5.5859265023774283,5.6263700185926995,0.54062439586068511,null,null,null,null,null,null,null,null,null,null,"etapa","Vol. Inflex.","total","parcial","[espécie]",3.4999999998981366,2.4933830945690478,0.11203721564149946,1.2177075348750692E-2]
[11.32941198447952,5.7817853807000468,5.800969957723205,0.32662601854994733,null,null,null,null,null,null,null,null,null,null,1,10.047833361532291,{"$f":"IF(P28<>\"\",P28*0.001*$R$25,\"\")","v":1.0047833361532291E-3},{"$f":"IF(P28<>\"\",Q28,\"\")","v":1.0047833361532291E-3},{"$f":"IF(P28<>\"\",R28/$R$24/0.001,\"\")","v":5.023916680766146E-2},3.6666666665599528,2.5123911084830399,0.1160463440202287,1.1877986595020122E-2]
[11.891695459780749,5.9333775681693366,5.9498505351300084,0.21842310493949785,null,null,null,null,null,null,null,null,null,null,2,30.01250000066441,{"$f":"IF(P29<>\"\",P29*0.001*$R$25,\"\")","v":3.0012500000664412E-3},{"$f":"IF(P29<>\"\",(Q29-Q28),\"\")","v":1.9964666639132123E-3},{"$f":"IF(P29<>\"\",R29/$R$24/0.001,\"\")","v":9.9823333195660613E-2},3.8333333332217689,2.5320590105397156,0.11995577365636007,1.1578889847600507E-2]
[12.661303962522652,6.1015246164126706,6.0975497546929853,0.15961767587332287,null,null,null,null,null,null,null,null,null,null,3,null,"",{"$f":"IF(P30<>\"\",(Q30-Q29),\"\")","v":""},"",3.9999999998835847,2.552370184281906,0.12376550454722904,1.1279793100222526E-2]
[13.68609245546395,6.2343706579746305,6.2373585060206231,0.12940471512893156,null,null,null,null,null,null,null,null,null,null,4,null,"","","",4.1666666665454013,2.5732575608785768,0.12653836520839193,5.1898725320476662E-3]
[14.998016964818817,6.4237087256565042,6.4272567565249483,0.16415814249331287,null,null,null,null,null,null,null,null,null,null,5,null,"","","",4.333333333207217,2.594433262584293,0.12722246958689071,-1.0789928950630634E-3]
[16.591740037256386,6.6692782825219714,6.6623664324466985,8.6695023720403011E-2,null,null,null,null,null,null,null,null,null,null,6,null,"","","",4.4999999998690328,2.6155490207556742,0.12581695317426056,-7.3478583222570601E-3]
[18.406854815839324,6.7265948707517058,6.7317303456254196,5.0545501636701823E-2,null,null,null,null,null,null,null,null,null,null,7,null,"","","",4.6666666665308494,2.6362565652605445,0.12232181596783695,-1.3616715755762013E-2]
[20.328983447689097,6.919625802232388,6.9194937491760591,0.11920556329351063,null,null,null,null,null,null,null,null,null,null,8,null,"","","",4.8333333331926651,2.6562076259667284,0.11673705796761988,-1.9885581182872744E-2]
[22.216620297695044,7.0953256149307116,7.0887918691417378,3.3962321941161451E-2,null,null,null,null,null,null,null,null,null,null,9,null,"","","",4.9999999998544808,2.6750539327420495,0.10906267917627388,-2.6154438616377694E-2]
[23.941385601938237,7.1512500737592566,7.1647414420374025,0.13597817354442276,null,null,null,null,null,null,null,null,null,null,10,null,"","","",5.1666666665162975,2.6924472154543322,9.9298679593798955E-2,-3.2423288056276874E-2]
[25.419121760933194,7.4514787286653243,7.4329580755025031,0.13503380799628742,null,null,null,null,null,null,null,null,null,null,"Resultado do exemplo: ",null,null,null,null,5.3333333331781132,2.708039203971401,8.7445059212201484E-2,-3.8692161477035011E-2]
[26.618562547082547,7.5401593301441734,7.5596299835371328,0.15172498308877611,null,null,null,null,null,null,null,null,null,null,"[H3PO4] =  0,0501 mol/L  (nos 20 mL de amostra sem diluir)",null,null,null,null,5.4999999998399289,2.7214816281610794,7.3501818042139622E-2,-4.4961018910539961E-2]
[27.550935077306349,7.7563774949247826,7.7429813680716082,0.20368142504405484,null,null,null,null,null,null,null,null,null,null,"[NaH2PO4] =  [H2PO4- titulado] - [H3PO4] = 0,1000 - 0,0501 = 0,0499 mol/L ",null,null,null,null,5.6666666665017456,2.732545491629895,6.0245811080305356E-2,-2.9735821806616828E-2]
[28.252110099128913,7.9134510497316528,7.8772984836701303,0.18924152373658837,null,null,null,null,null,null,null,null,null,null,"ou seja, nesta amostra metade do H2PO4- titulado provém do H3PO4",null,null,null,null,5.8333333331635613,2.7419603268952932,5.3920100447483715E-2,-8.2399447270298295E-3]
[28.76675075822277,7.9963996764286227,8.0049076159001462,0.37901352359584767,null,null,null,null,null,null,null,null,null,null,null,null,null,null,null,5.999999999825377,2.7509173875702602,5.4759681287026005E-2,1.325592435897221E-2]
[29.138159849389922,8.2263819666307043,8.1929929077639194,0.69928697951592,null,null,null,null,null,null,null,null,null,null,null,null,null,null,null,6.1666666664871936,2.7606108889005831,6.2764553601596745E-2,3.4751793444932615E-2]
[29.403460801404435,8.4238610949150825,8.4135759117230755,1.0529584187757943,null,null,null,null,null,null,null,null,null,null,null," Ler dados nas curvas",null,null,null,6.3333333331490094,2.7722350461320491,7.7934717393860486E-2,5.6247686511731169E-2]
[29.592312754539307,8.4704538960139431,8.6351335225611656,1.3952687871227101,null,null,null,null,null,null,null,null,null,null,null," Copiar curvas para",null,null,null,6.4999999998108251,2.7869840745104462,0.10027017265848816,7.7743555597712385E-2]
[29.727469007775653,8.8064331886117166,8.8341611651758605,1.6289122911840936,null,null,null,null,null,null,null,null,null,null,null," Mudar escalas",null,null,null,6.6666666664726417,2.8060521892815613,0.12977091939814428,9.9239424683735242E-2]
[29.826065547240432,9.0470594645874822,8.9982103608112141,1.7625324468647061,null,null,null,null,null,null,null,null,null,null,null,null,null,null,null,6.8333333331344575,2.8305753583805182,0.16444787681136983,9.8179232749377676E-2]
[29.901051959313918,8.9214273543590199,9.1314771179734837,1.8447043942775987,null,null,null,null,null,null,null,null,null,null,null,null,null,null,null,6.9999999997962732,2.8605113701517841,0.19363480334919192,7.6963547539546429E-2]
[29.962520969274919,9.1409056011009717,9.2451473863973401,1.8821441842181079,null,null,null,null,null,null,null,null,null,null,null,null,null,null,null,7.1666666664580898,2.8947231343978994,0.21574983461475986,5.5747854336026123E-2]
[30.018881628348026,9.3198510455583126,9.3512561440971069,1.8794345720166077,null,null,null,null,null,null,null,null,null,null,null,null,null,null,null,7.3333333331199055,2.9320320019069879,0.23079297060807366,3.4532161132589098E-2]
[30.077913562126923,9.6426810772611162,9.4620591570341315,1.8363361494087844,null,null,null,null,null,null,null,null,null,null,null,null,null,null,null,7.4999999997817213,2.9712593234671738,0.23876421133179784,1.3316475922674577E-2]
[30.147781588311773,9.6630212543003005,9.5895887346914996,1.7496322992318376,null,null,null,null,null,null,null,null,null,null,null,null,null,null,null,7.6666666664435379,3.0112264510722939,0.23966491348468583,-7.4464194814107846E-3]
[30.23810956365196,9.8054199161609681,9.7447987845771884,1.5996873874840556,null,null,null,null,null,null,null,null,null,null,null,null,null,null,null,7.8333333331053536,3.0510147381141026,0.2380976011647124,-1.9629418092375695E-3]
[30.361222689680289,10.1009536653353,9.9329995171793826,1.3519190895006081,null,null,null,null,null,null,null,null,null,null,null,null,null,null,null,7.9999999997671694,3.090693972992467,0.23835811535094331,3.5205438567079569E-3]
[30.533670484146569,10.113295776244147,10.145182769679167,1.0227742749426432,null,null,null,null,null,null,null,null,null,null,null,null,null,null,null,8.166666666428986,3.1305687934582704,0.2404464560380494,9.0040135352753951E-3]
[30.778127179655712,10.440725985515027,10.355608730750546,0.63017830603041758,null,null,null,null,null,null,null,null,null,null,null,null,null,null,null,8.3333333330908026,3.1709438372623948,0.24436262323668889,1.4487499201137654E-2]
[31.125704392616171,10.394143875602518,10.522684143376656,0.36544525834054203,null,null,null,null,null,null,null,null,null,null,null,null,null,null,null,8.4999999997526174,3.2127537529016355,0.26222237110182117,9.7471542842681058E-2]
[31.618546727986541,10.693185093665297,10.677008150373402,0.24039960659663734,null,null,null,null,null,null,null,null,null,null,null,null,null,null,null,8.6666666664144341,3.2599789458197872,0.30942692318371035,0.18566756932976952]
[32.312233893026132,10.788842607386293,10.793753306373763,0.11054590295780142,null,null,null,null,null,null,null,null,null,null,null,null,null,null,null,8.8333333330762507,3.3175190039951286,0.38603015286811038,0.2738636038106303]
[33.276938258495647,10.877864857281752,10.882167042175245,9.4697723297037462E-2,null,null,null,null,null,null,null,null,null,null,null,null,null,null,null,8.9999999997380655,3.3903460184422864,0.4933681237508184,0.37027138957086025]
[34.595723087841179,11.051299680096768,11.055811290940555,0.17623468778773954,null,null,null,null,null,null,null,null,null,null,null,null,null,null,null,9.1666666663998821,3.4837436667765198,0.63291077901771609,0.46688793633957631]
[36.358880750776734,11.370292142789795,11.363296617184082,0.10729439203867115,null,null,null,null,null,null,null,null,null,null,null,null,null,null,null,9.3333333330616988,3.6039347389667129,0.82271991488532481,0.69034921783128422]
[38.657043337298092,11.419295233251525,11.423452697093367,2.3984114612561593E-2,null,null,null,null,null,null,null,null,null,null,null,null,null,null,null,9.4999999997235136,3.7624362958580515,1.0913088884059261,0.89306457434413911]
[41.584617293847259,11.628946382172252,11.627354277970312,6.5317783107073119E-2,null,null,null,null,null,null,null,null,null,null,null,null,null,null,null,9.6666666663853302,3.9701736511568306,1.405575552038181,0.93282872631778413]
[45.275601847970393,11.730370279959102,11.730885070584325,2.0239006856164813E-2,null,null,null,null,null,null,null,null,null,null,null,null,null,null,null,9.8333333330471469,4.2282812400545851,1.6731273266693101,0.59354294282960496]
[49.999999998544808,11.913765583538456,11.913683305983376,4.8066328369968971E-2,null,null,null,null,null,null,null,null,null,null,null,null,null,null,null,9.9999999997089617,4.5200536754230942,1.8099075978839589,0.22271555800905488]
[null,null,null,null,null,null,null,null,null,null,null,null,null,null,null,null,null,null,null,10.166666666370778,4.8193077796195789,1.7207090287477769,-0.78250398165659352]
[null,null,null,null,null,null,null,null,null,null,null,null,null,null,null,null,null,null,null,10.333333333032595,5.0805989896209773,1.4049640901383833,-0.98358313499645067]
[null,null,null,null,null,null,null,null,null,null,null,null,null,null,null,null,null,null,null,10.49999999969441,5.2884091464244163,1.0951869747247818,-0.85845505109450193]
[null,null,null,null,null,null,null,null,null,null,null,null,null,null,null,null,null,null,null,10.666666666356226,5.4486813642849947,0.83729180375463508,-0.68580395766290925]
[null,null,null,null,null,null,null,null,null,null,null,null,null,null,null,null,null,null,null,10.833333333018043,5.5709817104671666,0.64081250218439401,-0.49326438936306899]
[null,null,null,null,null,null,null,null,null,null,null,null,null,null,null,null,null,null,null,10.999999999679858,5.6657943774104655,0.50510178926237537,-0.34663966099533694]
[null,null,null,null,null,null,null,null,null,null,null,null,null,null,null,null,null,null,null,11.166666666341674,5.741185676682619,0.40445466534433649,-0.25733239540747888]
[null,null,null,null,null,null,null,null,null,null,null,null,null,null,null,null,null,null,null,11.333333333003491,5.8022807263411966,0.33357192116139561,-0.16917726420754825]
[null,null,null,null,null,null,null,null,null,null,null,null,null,null,null,null,null,null,null,11.499999999665306,5.8535548825638033,0.28390931925708351,-0.12883869971633535]
[null,null,null,null,null,null,null,null,null,null,null,null,null,null,null,null,null,null,null,11.666666666327123,5.8976713332400861,0.24769290078917938,-8.8500135225372215E-2]
[null,null,null,null,null,null,null,null,null,null,null,null,null,null,null,null,null,null,null,11.833333332988939,5.9368711089435244,0.22492266576301234,-4.8161602708665679E-2]
[null,null,null,null,null,null,null,null,null,null,null,null,null,null,null,null,null,null,null,11.999999999650754,5.9732884065172458,0.21263479886798783,-3.5146525691833012E-2]
[null,null,null,null,null,null,null,null,null,null,null,null,null,null,null,null,null,null,null,12.166666666312571,6.0077364009292982,0.20063420144518171,-3.6855318798979672E-2]
[null,null,null,null,null,null,null,null,null,null,null,null,null,null,null,null,null,null,null,12.333333332974387,6.0401368771641604,0.18806401114282997,-3.8564111906043065E-2]
[null,null,null,null,null,null,null,null,null,null,null,null,null,null,null,null,null,null,null,12.499999999636202,6.0703949030756261,0.17492422796626164,-4.0272905013189725E-2]
[null,null,null,null,null,null,null,null,null,null,null,null,null,null,null,null,null,null,null,12.666666666298019,6.098415549646953,0.16121665757509859,-4.1655191298747243E-2]
[null,null,null,null,null,null,null,null,null,null,null,null,null,null,null,null,null,null,null,12.833333332959835,6.1242071815480026,0.14873917370727863,-3.3218132246765938E-2]
[null,null,null,null,null,null,null,null,null,null,null,null,null,null,null,null,null,null,null,12.99999999962165,6.148153361647676,0.13907404830831385,-2.4781073194951174E-2]
[null,null,null,null,null,null,null,null,null,null,null,null,null,null,null,null,null,null,null,13.166666666283467,6.1707228163571628,0.13222128138353337,-1.634398216863003E-2]
[null,null,null,null,null,null,null,null,null,null,null,null,null,null,null,null,null,null,null,13.333333332945283,6.1923842720876552,0.12818087292227906,-7.906907129520439E-3]
[null,null,null,null,null,null,null,null,null,null,null,null,null,null,null,null,null,null,null,13.499999999607098,6.2136064552503409,0.12695282292987994,5.3016790958914978E-4]
[null,null,null,null,null,null,null,null,null,null,null,null,null,null,null,null,null,null,null,13.666666666268915,6.2348580922564123,0.12853713140100698,8.9672429486987396E-3]
[null,null,null,null,null,null,null,null,null,null,null,null,null,null,null,null,null,null,null,13.833333332930732,6.2565592194605832,0.13194062595929115,1.066673149872035E-2]
[null,null,null,null,null,null,null,null,null,null,null,null,null,null,null,null,null,null,null,13.999999999592546,6.2788528308246736,0.13563143332579516,1.147729911177383E-2]
[null,null,null,null,null,null,null,null,null,null,null,null,null,null,null,null,null,null,null,14.166666666254363,6.3017840703064261,0.13959243356305087,1.2287882712122132E-2]
[null,null,null,null,null,null,null,null,null,null,null,null,null,null,null,null,null,null,null,14.33333333291618,6.3253979700508927,0.14382362667105822,1.3098466312303899E-2]
[null,null,null,null,null,null,null,null,null,null,null,null,null,null,null,null,null,null,null,14.499999999577994,6.3497395622031245,0.14832501264981726,1.3909033925357379E-2]
[null,null,null,null,null,null,null,null,null,null,null,null,null,null,null,null,null,null,null,14.666666666239811,6.3748538789081737,0.153096591499328,1.4719617525705679E-2]
[null,null,null,null,null,null,null,null,null,null,null,null,null,null,null,null,null,null,null,14.833333332901628,6.4007859523110913,0.15813836321426131,1.5530185138759159E-2]
[null,null,null,null,null,null,null,null,null,null,null,null,null,null,null,null,null,null,null,14.999999999563443,6.4275808144156823,0.16345009566563454,1.623303092043786E-2]
[null,null,null,null,null,null,null,null,null,null,null,null,null,null,null,null,null,null,null,15.166666666225259,6.4551966136120056,0.16748543118215775,7.9872268802898324E-3]
[null,null,null,null,null,null,null,null,null,null,null,null,null,null,null,null,null,null,null,15.333333332887076,6.4832561481232966,0.16877217084634771,-2.5856117248010732E-4]
[null,null,null,null,null,null,null,null,null,null,null,null,null,null,null,null,null,null,null,15.499999999548891,6.511301318639493,0.16731031464754623,-8.5043492253333141E-3]
[null,null,null,null,null,null,null,null,null,null,null,null,null,null,null,null,null,null,null,15.666666666210707,6.5388740258505313,0.16309986259108239,-1.6750121290974966E-2]
[null,null,null,null,null,null,null,null,null,null,null,null,null,null,null,null,null,null,null,15.833333332872524,6.5655161704463483,0.15614081467162713,-2.4995909343828171E-2]
[null,null,null,null,null,null,null,null,null,null,null,null,null,null,null,null,null,null,null,15.999999999534339,6.5907696531168813,0.14643317088918045,-3.3241713383809664E-2]
[null,null,null,null,null,null,null,null,null,null,null,null,null,null,null,null,null,null,null,16.166666666196157,6.6141763745520654,0.1339769312490714,-4.1487485449534581E-2]
[null,null,null,null,null,null,null,null,null,null,null,null,null,null,null,null,null,null,null,16.333333332857972,6.6352782354418389,0.11877209575130002,-4.9733257515134605E-2]
[null,null,null,null,null,null,null,null,null,null,null,null,null,null,null,null,null,null,null,16.499999999519787,6.6536171364761376,0.1008186643905372,-5.7979045567987809E-2]
[null,null,null,null,null,null,null,null,null,null,null,null,null,null,null,null,null,null,null,16.666666666181605,6.6687498205856004,8.0712231029029594E-2,-5.8293498032064434E-2]
[null,null,null,null,null,null,null,null,null,null,null,null,null,null,null,null,null,null,null,16.83333333284342,6.6806712218128785,6.2848761023967567E-2,-4.8896710683262505E-2]
[null,null,null,null,null,null,null,null,null,null,null,null,null,null,null,null,null,null,null,16.999999999505235,6.6898761376740667,4.8117538888072096E-2,-3.9499987283327612E-2]
[null,null,null,null,null,null,null,null,null,null,null,null,null,null,null,null,null,null,null,17.166666666167053,6.6968866094821253,3.6518564632001323E-2,-3.0103231908969613E-2]
[null,null,null,null,null,null,null,null,null,null,null,null,null,null,null,null,null,null,null,17.333333332828868,6.7022246785500164,2.8051838255755256E-2,-2.0706492521823168E-2]
[null,null,null,null,null,null,null,null,null,null,null,null,null,null,null,null,null,null,null,17.499999999490683,6.7064123861907019,2.2717359748675746E-2,-1.1309769121888278E-2]
[null,null,null,null,null,null,null,null,null,null,null,null,null,null,null,null,null,null,null,17.666666666152501,6.7099717737171423,2.051512912675001E-2,-1.9130137475198686E-3]
[null,null,null,null,null,null,null,null,null,null,null,null,null,null,null,null,null,null,null,17.833333332814316,6.7134248824423004,2.1445146384648971E-2,7.4837256396265766E-3]
[null,null,null,null,null,null,null,null,null,null,null,null,null,null,null,null,null,null,null,17.999999999476131,6.7172937536791366,2.5507411517043565E-2,1.6880481013984577E-2]
[null,null,null,null,null,null,null,null,null,null,null,null,null,null,null,null,null,null,null,18.166666666137949,6.7221004287406148,3.2701924523933786E-2,2.6277204413929875E-2]
[null,null,null,null,null,null,null,null,null,null,null,null,null,null,null,null,null,null,null,18.333333332799764,6.7283669489396942,4.3028685415977784E-2,3.5673959788287878E-2]
[null,null,null,null,null,null,null,null,null,null,null,null,null,null,null,null,null,null,null,18.499999999461579,6.7365941691292548,5.5804103531745655E-2,3.7744815275480521E-2]
[null,null,null,null,null,null,null,null,null,null,null,null,null,null,null,null,null,null,null,18.666666666123398,6.7469079057878156,6.7766500018802633E-2,3.403325621519588E-2]
[null,null,null,null,null,null,null,null,null,null,null,null,null,null,null,null,null,null,null,18.833333332785212,6.7591123788159653,7.8491702777025552E-2,3.0321665180446499E-2]
[null,null,null,null,null,null,null,null,null,null,null,null,null,null,null,null,null,null,null,18.999999999447027,6.7730013892599583,8.7979711811743494E-2,2.6610074145738755E-2]
[null,null,null,null,null,null,null,null,null,null,null,null,null,null,null,null,null,null,null,19.166666666108846,6.7883687381660511,9.6230527128285517E-2,2.2898499098200929E-2]
[null,null,null,null,null,null,null,null,null,null,null,null,null,null,null,null,null,null,null,19.33333333277066,6.8050082265804983,0.10324414872132257,1.9186924050704737E-2]
[null,null,null,null,null,null,null,null,null,null,null,null,null,null,null,null,null,null,null,19.499999999432475,6.8227136555495553,0.10902057659085462,1.5475349003166911E-2]
[null,null,null,null,null,null,null,null,null,null,null,null,null,null,null,null,null,null,null,19.666666666094294,6.8412788261194786,0.11355981074221076,1.1763789942840641E-2]
[null,null,null,null,null,null,null,null,null,null,null,null,null,null,null,null,null,null,null,19.833333332756109,6.8604975393365235,0.11686185116473286,8.0521829209213389E-3]
[null,null,null,null,null,null,null,null,null,null,null,null,null,null,null,null,null,null,null,19.999999999417923,6.8801635962469438,0.11892669786907903,4.3406238605950683E-3]
[null,null,null,null,null,null,null,null,null,null,null,null,null,null,null,null,null,null,null,20.166666666079742,6.9000707978969977,0.11975435084459116,6.2901683863413244E-4]
[null,null,null,null,null,null,null,null,null,null,null,null,null,null,null,null,null,null,null,20.333333332741557,6.9200129453884243,0.11934484985146436,-3.0737812297183275E-3]
[null,null,null,null,null,null,null,null,null,null,null,null,null,null,null,null,null,null,null,20.499999999403371,6.9397872113829155,0.11775728164119195,-6.448281908787476E-3]
[null,null,null,null,null,null,null,null,null,null,null,null,null,null,null,null,null,null,null,20.66666666606519,6.9592032398816919,0.11504487506976505,-9.8227825878566231E-3]
[null,null,null,null,null,null,null,null,null,null,null,null,null,null,null,null,null,null,null,20.833333332727005,6.9780735578240041,0.11120763012652549,-1.3197315241432148E-2]
[null,null,null,null,null,null,null,null,null,null,null,null,null,null,null,null,null,null,null,20.99999999938882,6.9962106921490994,0.10624554682213144,-1.6571815920501297E-2]
[null,null,null,null,null,null,null,null,null,null,null,null,null,null,null,null,null,null,null,21.166666666050638,7.0134271697962305,0.10015862515125383,-1.9946348573993553E-2]
[null,null,null,null,null,null,null,null,null,null,null,null,null,null,null,null,null,null,null,21.333333332712453,7.0295355177046455,9.2946865119221719E-2,-2.3320849253062704E-2]
[null,null,null,null,null,null,null,null,null,null,null,null,null,null,null,null,null,null,null,21.499999999374268,7.0443482628135943,8.461026672070604E-2,-2.6695365919343406E-2]
[null,null,null,null,null,null,null,null,null,null,null,null,null,null,null,null,null,null,null,21.666666666036086,7.0576779320623269,7.5148829955706792E-2,-3.0069882585665741E-2]
[null,null,null,null,null,null,null,null,null,null,null,null,null,null,null,null,null,null,null,21.833333332697901,7.0693370523900931,6.4562554829553045E-2,-3.3444399251946443E-2]
[null,null,null,null,null,null,null,null,null,null,null,null,null,null,null,null,null,null,null,21.999999999359716,7.0791381507361422,5.285144133691573E-2,-3.6818915918268781E-2]
[null,null,null,null,null,null,null,null,null,null,null,null,null,null,null,null,null,null,null,22.166666666021534,7.0868937540397248,4.0015489483123917E-2,-4.0193416597358748E-2]
[null,null,null,null,null,null,null,null,null,null,null,null,null,null,null,null,null,null,null,22.333333332683349,7.0924694186630903,2.7419718651076938E-2,-3.1889099362992029E-2]
[null,null,null,null,null,null,null,null,null,null,null,null,null,null,null,null,null,null,null,22.499999999345164,7.0962776239183496,1.9009383513178067E-2,-1.8586188589269886E-2]
[null,null,null,null,null,null,null,null,null,null,null,null,null,null,null,null,null,null,null,22.666666666006982,7.0990532622106466,1.5033349392450478E-2,-5.2833097899656466E-3]
[null,null,null,null,null,null,null,null,null,null,null,null,null,null,null,null,null,null,null,22.833333332668797,7.1015353837108615,1.5491616304881385E-2,8.0195849965449435E-3]
[null,null,null,null,null,null,null,null,null,null,null,null,null,null,null,null,null,null,null,22.999999999330612,7.1044630385898753,2.0384184245141719E-2,2.1322511757473437E-2]
[null,null,null,null,null,null,null,null,null,null,null,null,null,null,null,null,null,null,null,23.16666666599243,7.1085752770185691,2.9711053207902408E-2,3.4625422531205992E-2]
[null,null,null,null,null,null,null,null,null,null,null,null,null,null,null,null,null,null,null,23.333333332654245,7.1146111491678239,4.3472223193163455E-2,4.792831731771658E-2]
[null,null,null,null,null,null,null,null,null,null,null,null,null,null,null,null,null,null,null,23.49999999931606,7.1233097052085208,6.1667694200924855E-2,6.1231212104237577E-2]
[null,null,null,null,null,null,null,null,null,null,null,null,null,null,null,null,null,null,null,23.666666665977878,7.13540999531154,8.4297466241844754E-2,7.4534122877949319E-2]
[null,null,null,null,null,null,null,null,null,null,null,null,null,null,null,null,null,null,null,23.833333332639693,7.1516510696477624,0.111361539305265,8.7837017664449499E-2]
[null,null,null,null,null,null,null,null,null,null,null,null,null,null,null,null,null,null,null,23.999999999301508,7.1727581087384138,0.14214801707326952,8.9028976196402293E-2]
[null,null,null,null,null,null,null,null,null,null,null,null,null,null,null,null,null,null,null,24.166666665963326,7.1987243150723135,0.1682985061282192,6.7895113535309887E-2]
[null,null,null,null,null,null,null,null,null,null,null,null,null,null,null,null,null,null,null,24.333333332625141,7.2284624710611984,0.1874043683064571,4.6761202912499536E-2]
[null,null,null,null,null,null,null,null,null,null,null,null,null,null,null,null,null,null,null,24.499999999286956,7.2607984722262389,0.19946560361331228,2.5627324264195565E-2]
[null,null,null,null,null,null,null,null,null,null,null,null,null,null,null,null,null,null,null,24.666666665948775,7.2945582140886085,0.20448221204878475,4.4934456158083249E-3]
[null,null,null,null,null,null,null,null,null,null,null,null,null,null,null,null,null,null,null,24.833333332610589,7.3285675921694766,0.20245419360754546,-1.6640433032495645E-2]
[null,null,null,null,null,null,null,null,null,null,null,null,null,null,null,null,null,null,null,24.999999999272404,7.3616525019900161,0.1933815483002525,-3.7774295693671328E-2]
[null,null,null,null,null,null,null,null,null,null,null,null,null,null,null,null,null,null,null,25.166666665934223,7.3926388390713997,0.17726427611091872,-5.8908190329186857E-2]
[null,null,null,null,null,null,null,null,null,null,null,null,null,null,null,null,null,null,null,25.333333332596037,7.4203524989347978,0.15410237705553129,-8.0042068977490832E-2]
[null,null,null,null,null,null,null,null,null,null,null,null,null,null,null,null,null,null,null,25.499999999257852,7.4436693975898596,0.12575507696876606,-7.8235306238017985E-2]
[null,null,null,null,null,null,null,null,null,null,null,null,null,null,null,null,null,null,null,25.666666665919671,7.4626995860586129,0.10403769790504311,-5.2095144201475693E-2]
[null,null,null,null,null,null,null,null,null,null,null,null,null,null,null,null,null,null,null,25.833333332581486,7.4788356012739374,9.1033711318451602E-2,-2.5954950190593563E-2]
[null,null,null,null,null,null,null,null,null,null,null,null,null,null,null,null,null,null,null,25.9999999992433,7.4935296753140985,8.67431171983334E-2,1.8522783307701253E-4]
[null,null,null,null,null,null,null,null,null,null,null,null,null,null,null,null,null,null,null,26.166666665905119,7.5082340402573609,9.1165915550017573E-2,2.6325405856747589E-2]
[null,null,null,null,null,null,null,null,null,null,null,null,null,null,null,null,null,null,null,26.333333332566934,7.5244009281819881,0.10430210636817505,5.2465583880418165E-2]
[null,null,null,null,null,null,null,null,null,null,null,null,null,null,null,null,null,null,null,26.499999999228748,7.543482571166245,0.12615168965813492,7.8605761904088745E-2]
[null,null,null,null,null,null,null,null,null,null,null,null,null,null,null,null,null,null,null,26.666666665890567,7.5669201369895633,0.1560222500095354,9.0401590218885733E-2]
[null,null,null,null,null,null,null,null,null,null,null,null,null,null,null,null,null,null,null,26.833333332552382,7.5952143533813015,0.18222573144297197,6.6842851257966893E-2]
[null,null,null,null,null,null,null,null,null,null,null,null,null,null,null,null,null,null,null,26.999999999214197,7.6272220610639767,0.20057629258347418,4.3284080322541676E-2]
[null,null,null,null,null,null,null,null,null,null,null,null,null,null,null,null,null,null,null,27.166666665876015,7.6616344399895135,0.2110739334363711,1.972530938703319E-2]
[null,null,null,null,null,null,null,null,null,null,null,null,null,null,null,null,null,null,null,27.33333333253783,7.6971426701098338,0.21371865400166276,-3.8334295740521836E-3]
[null,null,null,null,null,null,null,null,null,null,null,null,null,null,null,null,null,null,null,27.499999999199645,7.7324379313768636,0.20851045427934917,-2.7392184522265845E-2]
[null,null,null,null,null,null,null,null,null,null,null,null,null,null,null,null,null,null,null,27.666666665861463,7.7663174100178933,0.19820119339941178,-2.7207228471785271E-2]
[null,null,null,null,null,null,null,null,null,null,null,null,null,null,null,null,null,null,null,27.833333332523278,7.7986944130431031,0.19090637631813898,-1.6572311524059503E-2]
[null,null,null,null,null,null,null,null,null,null,null,null,null,null,null,null,null,null,null,27.999999999185093,7.8301507322134034,0.18715653211754521,-5.9373626019106271E-3]
[null,null,null,null,null,null,null,null,null,null,null,null,null,null,null,null,null,null,null,28.166666665846911,7.8612771963413008,0.18695166078164327,4.6975223713087624E-3]
[null,null,null,null,null,null,null,null,null,null,null,null,null,null,null,null,null,null,null,28.333333332508726,7.8927635297395575,0.19395199220038553,6.0303921859662185E-2]
[null,null,null,null,null,null,null,null,null,null,null,null,null,null,null,null,null,null,null,28.499999999170541,7.9277152071752059,0.23122287557837556,0.16321844676764746]
[null,null,null,null,null,null,null,null,null,null,null,null,null,null,null,null,null,null,null,28.666666665832359,7.9717345764590002,0.30279859922181812,0.2661329716757993]
[null,null,null,null,null,null,null,null,null,null,null,null,null,null,null,null,null,null,null,28.833333332494174,8.0305262905348318,0.4081000678203251,0.36037179642500405]
[null,null,null,null,null,null,null,null,null,null,null,null,null,null,null,null,null,null,null,28.999999999155989,8.1092951190074949,0.54177053780235751,0.4415697887593944]
[null,null,null,null,null,null,null,null,null,null,null,null,null,null,null,null,null,null,null,29.166666665817807,8.2125995512659742,0.7029249762302866,0.53734488861610485]
[null,null,null,null,null,null,null,null,null,null,null,null,null,null,null,null,null,null,null,29.333333332479622,8.3462059920003622,0.90980494447540072,0.70376853149261986]
[null,null,null,null,null,null,null,null,null,null,null,null,null,null,null,null,null,null,null,29.499999999141437,8.5189579261834609,1.173630053122616,0.88539892223017402]
[null,null,null,null,null,null,null,null,null,null,null,null,null,null,null,null,null,null,null,29.666666665803255,8.7405712164179672,1.4869333399018845,0.89054952217687011]
[null,null,null,null,null,null,null,null,null,null,null,null,null,null,null,null,null,null,null,29.83333333246507,9.0108302989836648,1.7410741538706376,0.62336212995066753]
[null,null,null,null,null,null,null,null,null,null,null,null,null,null,null,null,null,null,null,29.999999999126885,9.3156319267701111,1.8860715306788145,7.1463283295073857E-2]
[null,null,null,null,null,null,null,null,null,null,null,null,null,null,null,null,null,null,null,30.166666665788703,9.6230530640774159,1.7587843729544086,-0.70885470297674902]
[null,null,null,null,null,null,null,null,null,null,null,null,null,null,null,null,null,null,null,30.333333332450518,9.89300553025166,1.4629190269629937,-1.0281218437201993]
[null,null,null,null,null,null,null,null,null,null,null,null,null,null,null,null,null,null,null,30.499999999112333,10.10824458672597,1.127611491189517,-0.92409424118169936]
[null,null,null,null,null,null,null,null,null,null,null,null,null,null,null,null,null,null,null,30.666666665774152,10.271780737699045,0.84025482556130038,-0.813277701231096]
[null,null,null,null,null,null,null,null,null,null,null,null,null,null,null,null,null,null,null,30.833333332435966,10.39020169081958,0.58889184507586445,-0.64693888649909215]
[null,null,null,null,null,null,null,null,null,null,null,null,null,null,null,null,null,null,null,30.999999999097781,10.473283290779515,0.42523677922006986,-0.33530311329409396]
[null,null,null,null,null,null,null,null,null,null,null,null,null,null,null,null,null,null,null,31.1666666657596,10.537691837262306,0.36214371223396807,-0.10430562014710965]
[null,null,null,null,null,null,null,null,null,null,null,null,null,null,null,null,null,null,null,31.333333332421414,10.595002197574242,0.32462843519333029,-0.12076953837682579]
[null,null,null,null,null,null,null,null,null,null,null,null,null,null,null,null,null,null,null,31.499999999083229,10.645603138055275,0.2816251862835879,-0.13723345660654193]
[null,null,null,null,null,null,null,null,null,null,null,null,null,null,null,null,null,null,null,31.666666665745048,10.688589198429771,0.23370962776395224,-0.14177561525604182]
[null,null,null,null,null,null,null,null,null,null,null,null,null,null,null,null,null,null,null,31.833333332406863,10.723836415509352,0.19059318224478736,-0.11694785940326657]
[null,null,null,null,null,null,null,null,null,null,null,null,null,null,null,null,null,null,null,31.999999999068677,10.752586530105978,0.15575267388810204,-9.2120071576234766E-2]
[null,null,null,null,null,null,null,null,null,null,null,null,null,null,null,null,null,null,null,32.166666665730496,10.776218865079171,0.12918810270455447,-6.729218782585035E-2]
[null,null,null,null,null,null,null,null,null,null,null,null,null,null,null,null,null,null,null,32.333333332392314,10.796112507809209,0.11086572214192432,-4.4051258643393071E-2]
[null,null,null,null,null,null,null,null,null,null,null,null,null,null,null,null,null,null,null,32.499999999054126,10.813481532152968,9.8232893608968364E-2,-3.1757956266637036E-2]
[null,null,null,null,null,null,null,null,null,null,null,null,null,null,null,null,null,null,null,32.666666665715944,10.82908622215608,8.9697807807932864E-2,-1.9464749813108698E-2]
[null,null,null,null,null,null,null,null,null,null,null,null,null,null,null,null,null,null,null,32.833333332377762,10.843609534942027,8.5260464738817807E-2,-7.1715433595803645E-3]
[null,null,null,null,null,null,null,null,null,null,null,null,null,null,null,null,null,null,null,32.999999999039574,10.857734427634291,8.4920864422939488E-2,5.1216950683294479E-3]
[null,null,null,null,null,null,null,null,null,null,null,null,null,null,null,null,null,null,null,33.166666665701392,10.872143857356358,8.8679006838981625E-2,1.7414901521899416E-2]
[null,null,null,null,null,null,null,null,null,null,null,null,null,null,null,null,null,null,null,33.33333333236321,10.887516842021457,9.6324721332724614E-2,2.5992392240055531E-2]
[null,null,null,null,null,null,null,null,null,null,null,null,null,null,null,null,null,null,null,33.499999999025022,10.904304397242267,0.10520770647510552,2.7304270845882897E-2]
[null,null,null,null,null,null,null,null,null,null,null,null,null,null,null,null,null,null,null,33.66666666568684,10.922608854660952,0.11452798500833059,2.8616149451710263E-2]
[null,null,null,null,null,null,null,null,null,null,null,null,null,null,null,null,null,null,null,33.833333332348658,10.94250309650991,0.12428555692174166,2.9927996083114517E-2]
[null,null,null,null,null,null,null,null,null,null,null,null,null,null,null,null,null,null,null,33.99999999901047,10.964060005021533,0.13448042224731316,3.1239906663364993E-2]
[null,null,null,null,null,null,null,null,null,null,null,null,null,null,null,null,null,null,null,34.166666665672288,10.987352462428227,0.14511258096372884,3.2551785269150722E-2]
[null,null,null,null,null,null,null,null,null,null,null,null,null,null,null,null,null,null,null,34.333333332334107,11.012453350962383,0.15618203307098866,3.3863663875019726E-2]
[null,null,null,null,null,null,null,null,null,null,null,null,null,null,null,null,null,null,null,34.499999998995918,11.0394355528564,0.16768877857975079,3.5175574455311831E-2]
[null,null,null,null,null,null,null,null,null,null,null,null,null,null,null,null,null,null,null,34.666666665657736,11.068363726638612,0.17928424304070023,3.1585518202762446E-2]
[null,null,null,null,null,null,null,null,null,null,null,null,null,null,null,null,null,null,null,34.833333332319555,11.099026450400848,0.18811037834091235,2.1381520555291966E-2]
[null,null,null,null,null,null,null,null,null,null,null,null,null,null,null,null,null,null,null,34.999999998981366,11.130877034917948,0.19353517076433999,1.1177522907821492E-2]
[null,null,null,null,null,null,null,null,null,null,null,null,null,null,null,null,null,null,null,35.166666665643184,11.163348589710939,0.19555862030032503,9.7342933716495247E-4]
[null,null,null,null,null,null,null,null,null,null,null,null,null,null,null,null,null,null,null,35.333333332305003,11.195874224300837,0.19418072699150002,-9.2305363358824132E-3]
[null,null,null,null,null,null,null,null,null,null,null,null,null,null,null,null,null,null,null,35.499999998966814,11.22788704820867,0.18940149078457427,-1.9434597932115844E-2]
[null,null,null,null,null,null,null,null,null,null,null,null,null,null,null,null,null,null,null,35.666666665628632,11.258820170955458,0.18122091171152219,-2.963859557950305E-2]
[null,null,null,null,null,null,null,null,null,null,null,null,null,null,null,null,null,null,null,35.833333332290451,11.288106702062226,0.16963898975102751,-3.984268915024286E-2]
[null,null,null,null,null,null,null,null,null,null,null,null,null,null,null,null,null,null,null,35.999999998952262,11.315179751049993,0.15465572493506463,-5.0046686797630066E-2]
[null,null,null,null,null,null,null,null,null,null,null,null,null,null,null,null,null,null,null,36.166666665614081,11.339472427439784,0.13627111724231727,-6.0250716419523655E-2]
[null,null,null,null,null,null,null,null,null,null,null,null,null,null,null,null,null,null,null,36.333333332275899,11.360417840752621,0.11448516666212732,-7.0454778015798719E-2]
[null,null,null,null,null,null,null,null,null,null,null,null,null,null,null,null,null,null,null,36.49999999893771,11.377549463985339,9.1433982713159251E-2,-6.5539733644030068E-2]
[null,null,null,null,null,null,null,null,null,null,null,null,null,null,null,null,null,null,null,36.666666665599529,11.39104058575071,7.0864023920266972E-2,-5.788764667948585E-2]
[null,null,null,null,null,null,null,null,null,null,null,null,null,null,null,null,null,null,null,36.833333332261347,11.401315726403249,5.2844760057385906E-2,-5.0235559714983266E-2]
[null,null,null,null,null,null,null,null,null,null,null,null,null,null,null,null,null,null,null,36.999999998923158,11.408800001764881,3.7376191124516053E-2,-4.2583472750480682E-2]
[null,null,null,null,null,null,null,null,null,null,null,null,null,null,null,null,null,null,null,37.166666665584977,11.413918527657534,2.4458317110999279E-2,-3.493141776038039E-2]
[null,null,null,null,null,null,null,null,null,null,null,null,null,null,null,null,null,null,null,37.333333332246795,11.417096419903132,1.4091138048810002E-2,-2.7279330795862197E-2]
[null,null,null,null,null,null,null,null,null,null,null,null,null,null,null,null,null,null,null,37.499999998908606,11.418758794323601,6.2746539059737993E-3,-1.9627275805764507E-2]
[null,null,null,null,null,null,null,null,null,null,null,null,null,null,null,null,null,null,null,37.666666665570425,11.419330766740867,1.0088647038069517E-3,-1.1975156866825801E-2]
[null,null,null,null,null,null,null,null,null,null,null,null,null,null,null,null,null,null,null,37.833333332232243,11.419237452976855,-1.70622956834868E-3,-4.3230699023082547E-3]
[null,null,null,null,null,null,null,null,null,null,null,null,null,null,null,null,null,null,null,37.999999998894054,11.418903968853492,-1.8706289104930963E-3,3.329017062208642E-3]
[null,null,null,null,null,null,null,null,null,null,null,null,null,null,null,null,null,null,null,38.166666665555873,11.418755430192704,5.1566667737370272E-4,1.0981104026725863E-2]
[null,null,null,null,null,null,null,null,null,null,null,null,null,null,null,null,null,null,null,38.333333332217691,11.419216952816416,5.4526571952517172E-3,1.8633159016818675E-2]
[null,null,null,null,null,null,null,null,null,null,null,null,null,null,null,null,null,null,null,38.499999998879503,11.420713652546553,1.2940342653799088E-2,2.628530993018309E-2]
[null,null,null,null,null,null,null,null,null,null,null,null,null,null,null,null,null,null,null,38.666666665541321,11.423670626290276,2.2972723787930929E-2,3.3324639050197842E-2]
[null,null,null,null,null,null,null,null,null,null,null,null,null,null,null,null,null,null,null,38.833333332203139,11.428396765801413,3.3587128141033221E-2,3.0364766702798963E-2]
[null,null,null,null,null,null,null,null,null,null,null,null,null,null,null,null,null,null,null,38.999999998864951,11.43480983653296,4.3214911810288525E-2,2.7404894355431308E-2]
[null,null,null,null,null,null,null,null,null,null,null,null,null,null,null,null,null,null,null,39.166666665526769,11.442745401704318,5.1856074795696837E-2,2.4445022008022021E-2]
[null,null,null,null,null,null,null,null,null,null,null,null,null,null,null,null,null,null,null,39.333333332188587,11.452039024534887,5.9510617097258169E-2,2.1485181635056659E-2]
[null,null,null,null,null,null,null,null,null,null,null,null,null,null,null,null,null,null,null,39.499999998850399,11.462526268244066,6.6178538714972507E-2,1.8525309287668188E-2]
[null,null,null,null,null,null,null,null,null,null,null,null,null,null,null,null,null,null,null,39.666666665512217,11.474042696051253,7.1859839659497993E-2,1.5565468914702826E-2]
[null,null,null,null,null,null,null,null,null,null,null,null,null,null,null,null,null,null,null,39.833333332174035,11.48642387117585,7.6554519909518365E-2,1.2605596567314355E-2]
[null,null,null,null,null,null,null,null,null,null,null,null,null,null,null,null,null,null,null,39.999999998835847,11.499505356837256,8.0262579475691737E-2,9.6457242199258844E-3]
[null,null,null,null,null,null,null,null,null,null,null,null,null,null,null,null,null,null,null,40.166666665497665,11.513122716254868,8.2984018368676263E-2,6.6859158213419994E-3]
[null,null,null,null,null,null,null,null,null,null,null,null,null,null,null,null,null,null,null,40.333333332159484,11.527111512648089,8.4718836567155675E-2,3.7260114995720513E-3]
[null,null,null,null,null,null,null,null,null,null,null,null,null,null,null,null,null,null,null,40.499999998821295,11.541307309236316,8.5467034081788087E-2,7.6613915218358007E-4]
[null,null,null,null,null,null,null,null,null,null,null,null,null,null,null,null,null,null,null,40.666666665483113,11.555545669238949,8.5228610923231654E-2,-2.193669246358671E-3]
[null,null,null,null,null,null,null,null,null,null,null,null,null,null,null,null,null,null,null,40.833333332144932,11.569662155875388,8.4003567070170079E-2,-5.1535415937887753E-3]
[null,null,null,null,null,null,null,null,null,null,null,null,null,null,null,null,null,null,null,40.999999998806743,11.583492332365033,8.1791902533261532E-2,-8.1134459156003563E-3]
[null,null,null,null,null,null,null,null,null,null,null,null,null,null,null,null,null,null,null,41.166666665468561,11.596871761927281,7.8593617323164139E-2,-1.1073254314142609E-2]
[null,null,null,null,null,null,null,null,null,null,null,null,null,null,null,null,null,null,null,41.33333333213038,11.609636007781534,7.4408711418561618E-2,-1.4033158635954189E-2]
[null,null,null,null,null,null,null,null,null,null,null,null,null,null,null,null,null,null,null,41.499999998792191,11.62162063314719,6.9237184840770238E-2,-1.6992999008919551E-2]
[null,null,null,null,null,null,null,null,null,null,null,null,null,null,null,null,null,null,null,41.666666665454009,11.63266569070097,6.3243520832820685E-2,-1.7952263676646714E-2]
[null,null,null,null,null,null,null,null,null,null,null,null,null,null,null,null,null,null,null,41.833333332115828,11.642718324065822,5.7443612449754426E-2,-1.6848282769902263E-2]
[null,null,null,null,null,null,null,null,null,null,null,null,null,null,null,null,null,null,null,41.999999998777639,11.651834941804662,5.2011701315372527E-2,-1.5744301863157811E-2]
[null,null,null,null,null,null,null,null,null,null,null,null,null,null,null,null,null,null,null,42.166666665439458,11.660076876791532,4.694778741901684E-2,-1.4640320956413362E-2]
[null,null,null,null,null,null,null,null,null,null,null,null,null,null,null,null,null,null,null,42.333333332101276,11.667505461900467,4.2251870782003653E-2,-1.3536308075224985E-2]
[null,null,null,null,null,null,null,null,null,null,null,null,null,null,null,null,null,null,null,42.499999998763087,11.674182030005506,3.7923951372358544E-2,-1.2432327168459717E-2]
[null,null,null,null,null,null,null,null,null,null,null,null,null,null,null,null,null,null,null,42.666666665424906,11.680167913980688,3.3964029222055929E-2,-1.1328314287292156E-2]
[null,null,null,null,null,null,null,null,null,null,null,null,null,null,null,null,null,null,null,42.833333332086724,11.685524446700049,3.0372104309779529E-2,-1.0224301406103779E-2]
[null,null,null,null,null,null,null,null,null,null,null,null,null,null,null,null,null,null,null,42.999999998748535,11.69031296103763,2.7148176635529341E-2,-9.1203524737824369E-3]
[null,null,null,null,null,null,null,null,null,null,null,null,null,null,null,null,null,null,null,43.166666665410354,11.694594789867468,2.4292246209963512E-2,-8.016339592604468E-3]
[null,null,null,null,null,null,null,null,null,null,null,null,null,null,null,null,null,null,null,43.333333332072172,11.698431266063599,2.1804313033082039E-2,-6.9123267114160909E-3]
[null,null,null,null,null,null,null,null,null,null,null,null,null,null,null,null,null,null,null,43.499999998733983,11.701883722500066,1.9684377083568641E-2,-5.8083777790843422E-3]
[null,null,null,null,null,null,null,null,null,null,null,null,null,null,null,null,null,null,null,43.666666665395802,11.705013492050902,1.793243839339774E-2,-4.7043968723294834E-3]
[null,null,null,null,null,null,null,null,null,null,null,null,null,null,null,null,null,null,null,43.83333333205762,11.707881907590147,1.6548496951911192E-2,-3.6003520167284041E-3]
[null,null,null,null,null,null,null,null,null,null,null,null,null,null,null,null,null,null,null,43.999999998719431,11.710550301991841,1.5532552748450862E-2,-2.4963711099735449E-3]
[null,null,null,null,null,null,null,null,null,null,null,null,null,null,null,null,null,null,null,44.16666666538125,11.713080008130021,1.4884605783016746E-2,-1.3923902032186859E-3]
[null,null,null,null,null,null,null,null,null,null,null,null,null,null,null,null,null,null,null,44.333333332043068,11.715532358878724,1.4604656066266986E-2,-2.8840929646382679E-4]
[null,null,null,null,null,null,null,null,null,null,null,null,null,null,null,null,null,null,null,44.49999999870488,11.717968687111989,1.4692703587543442E-2,8.1557161029623636E-4]
[null,null,null,null,null,null,null,null,null,null,null,null,null,null,null,null,null,null,null,44.666666665366698,11.720450325703855,1.5148748368162395E-2,1.9195844914742055E-3]
[null,null,null,null,null,null,null,null,null,null,null,null,null,null,null,null,null,null,null,44.833333332028516,11.723038607528357,1.5972790386807562E-2,3.0235973726573787E-3]
[null,null,null,null,null,null,null,null,null,null,null,null,null,null,null,null,null,null,null,44.999999998690328,11.725794865459537,1.7164829643478943E-2,4.1275782794018296E-3]
[null,null,null,null,null,null,null,null,null,null,null,null,null,null,null,null,null,null,null,45.166666665352146,11.728780432371433,1.8724866148834684E-2,5.2315272117439866E-3]
[null,null,null,null,null,null,null,null,null,null,null,null,null,null,null,null,null,null,null,45.333333332013964,11.732056135470193,2.0626547073621892E-2,5.8803522055052562E-3]
[null,null,null,null,null,null,null,null,null,null,null,null,null,null,null,null,null,null,null,45.499999998675776,11.735655129517195,2.2551639148761432E-2,5.6703441945178887E-3]
[null,null,null,null,null,null,null,null,null,null,null,null,null,null,null,null,null,null,null,45.666666665337594,11.73956914435847,2.4406726613790182E-2,5.4604001323767422E-3]
[null,null,null,null,null,null,null,null,null,null,null,null,null,null,null,null,null,null,null,45.833333331999413,11.743786512557195,2.6191809447391856E-2,5.2503921213789663E-3]
[null,null,null,null,null,null,null,null,null,null,null,null,null,null,null,null,null,null,null,45.999999998661224,11.748295566676546,2.7906887649566458E-2,5.0403201615349703E-3]
[null,null,null,null,null,null,null,null,null,null,null,null,null,null,null,null,null,null,null,46.166666665323042,11.753084639279695,2.9551961241630269E-2,4.8303441249707138E-3]
[null,null,null,null,null,null,null,null,null,null,null,null,null,null,null,null,null,null,null,46.333333331984861,11.758142062929821,3.1127030202267005E-2,4.6202721651267178E-3]
[null,null,null,null,null,null,null,null,null,null,null,null,null,null,null,null,null,null,null,46.499999998646672,11.763456170190095,3.2632094552792951E-2,4.4102641541289419E-3]
[null,null,null,null,null,null,null,null,null,null,null,null,null,null,null,null,null,null,null,46.66666666530849,11.769015293623694,3.4067154282549965E-2,4.2002561431207586E-3]
[null,null,null,null,null,null,null,null,null,null,null,null,null,null,null,null,null,null,null,46.833333331970309,11.774807765793792,3.5432209391538051E-2,3.9902801065773178E-3]
[null,null,null,null,null,null,null,null,null,null,null,null,null,null,null,null,null,null,null,46.99999999863212,11.780821919263564,3.6727259879757203E-2,3.7802720955899508E-3]
[null,null,null,null,null,null,null,null,null,null,null,null,null,null,null,null,null,null,null,47.166666665293938,11.787046086596188,3.7952305736549279E-2,3.5702321101586565E-3]
[null,null,null,null,null,null,null,null,null,null,null,null,null,null,null,null,null,null,null,47.333333331955757,11.793468600354835,3.9107346983230561E-2,3.3602240991504728E-3]
[null,null,null,null,null,null,null,null,null,null,null,null,null,null,null,null,null,null,null,47.499999998617568,11.800077793102682,4.0192383609142915E-2,3.1502480625862157E-3]
[null,null,null,null,null,null,null,null,null,null,null,null,null,null,null,null,null,null,null,47.666666665279386,11.806861997402905,4.1207415614286341E-2,2.9402400515988482E-3]
[null,null,null,null,null,null,null,null,null,null,null,null,null,null,null,null,null,null,null,47.833333331941205,11.813809545818678,4.2152442988002685E-2,2.7301680917444443E-3]
[null,null,null,null,null,null,null,null,null,null,null,null,null,null,null,null,null,null,null,47.999999998603016,11.820908770913174,4.3027465740950108E-2,2.5201600807778935E-3]
[null,null,null,null,null,null,null,null,null,null,null,null,null,null,null,null,null,null,null,48.166666665264835,11.82814800524957,4.3832483894444871E-2,2.3101840441928198E-3]
[null,null,null,null,null,null,null,null,null,null,null,null,null,null,null,null,null,null,null,48.333333331926653,11.835515581391043,4.4567497405854424E-2,2.1001440587823427E-3]
[null,null,null,null,null,null,null,null,null,null,null,null,null,null,null,null,null,null,null,48.499999998588464,11.842999831900764,4.5232506296495043E-2,1.8901040733718651E-3]
[null,null,null,null,null,null,null,null,null,null,null,null,null,null,null,null,null,null,null,48.666666665250283,11.850589089341909,4.5827510577024874E-2,1.6801280368076081E-3]
[null,null,null,null,null,null,null,null,null,null,null,null,null,null,null,null,null,null,null,48.833333331912101,11.858271686277655,4.6352510236785771E-2,1.4701200257994241E-3]
[null,null,null,null,null,null,null,null,null,null,null,null,null,null,null,null,null,null,null,48.999999998573912,11.866035955271176,4.6807505265119592E-2,1.260112014812057E-3]
[null,null,null,null,null,null,null,null,null,null,null,null,null,null,null,null,null,null,null,49.166666665235731,11.873870228885648,4.7192495672684485E-2,1.0500400549784694E-3]
[null,null,null,null,null,null,null,null,null,null,null,null,null,null,null,null,null,null,null,49.333333331897549,11.881762839684244,4.7507481470138585E-2,8.4006401839339571E-4]
[null,null,null,null,null,null,null,null,null,null,null,null,null,null,null,null,null,null,null,49.49999999855936,11.889702120230139,4.775246264682375E-2,6.3008798180832191E-4]
[null,null,null,null,null,null,null,null,null,null,null,null,null,null,null,null,null,null,null,49.666666665221179,11.897676403086511,4.7927439192081846E-2,4.2001602197473442E-4]
[null,null,null,null,null,null,null,null,null,null,null,null,null,null,null,null,null,null,null,49.833333331882997,11.90567402081653,4.8032411127229155E-2,2.1003998543129405E-4]
[null,null,null,null,null,null,null,null,null,null,null,null,null,null,null,null,null,null,null,49.999999998544808,11.913683305983376,4.8067378430949381E-2,0]

{"sheet":"+I","index":7,"n_rows":4,"n_cols":4,"rows_kept":4,"cut":false,"hidden":false,"merged":[]}
[null,null,"           ","Compilação de dados e resultados da Analise_I"]
[]
[]
[null,"Identifique os resultados e acrescente observações (nas células em cinza)"]

{"sheet":"Analise_II","index":8,"n_rows":202,"n_cols":50,"rows_kept":202,"cut":false,"hidden":false,"merged":[]}
[null,"       Análise de Dados de Titulação II – Regressão",null,null,null,null,"<--- leia instruções e observações importantes",null,null,null,"  pKa dos ácidos e bases em solução",null,null,"Clique em K2 a Q2; selecione ácidos/bases; clique em J2; leia M1",null,null,null,null,null,null,"         Constantes cumulativas de protonação = bp = PKp (calculado pela planilha)",null,null,null,null,null,null,null,null,null,null,"       pKas dos ácidos HiB, carregados da planilha Constantes ",null,null,null,null,null,null,null,null,null,"Instalação do Solver"]
["     Concentrações (em mol/L) na amostra (ajustadas por regressão, em azul, e de equilíbrio) e no titulante (conhecidas)",null,null,null,null,null,null,null,null,null,3,181,24,1,7,2,4,null,"Titulante",null,null,"Titulado",null,null,null,null,null,null,"Titulante",null,null,null,"    Titulado","Clique em J2 para usar estes pKas na regressão",null,null,null,null,null,null,null,"O Solver é um suplemento gratuito do Excel usado pra Regressão Não Linear no módulo Análise II"]
["AMOSTRA Espécie",{"$f":"K3","v":"Ácido cítrico"},{"$f":"L3","v":"Glicina"},"Ácido ascórbico","Ácido acético","Hidróxido de amônio","Ácido carbônico","Ácido clorídrico",null,"Ácido / Base","Ácido cítrico","Glicina","Ácido ascórbico","Ácido acético","Hidróxido de amônio","Ácido carbônico","Ácido clorídrico","Ácido forte","Base forte","Ác. carbônico","Ácido / Base",{"$f":"K3","v":"Ácido cítrico"},"Glicina","Ácido ascórbico","Ácido acético","Hidróxido de amônio","Ácido carbônico","Ácido clorídrico","Ácido forte","Base forte","Ác. carbônico","Ácido / Base",{"$f":"IF(VLOOKUP(K$2,Constantes!$B$23:$N$303,2)=\"\",\"\",VLOOKUP(K$2,Constantes!$B$23:$N$303,2))","v":"Ácido cítrico"},{"$f":"IF(VLOOKUP(L$2,Constantes!$B$23:$N$303,2)=\"\",\"\",VLOOKUP(L$2,Constantes!$B$23:$N$303,2))","v":"o-Fenotidina"},{"$f":"IF(VLOOKUP(M$2,Constantes!$B$23:$N$303,2)=\"\",\"\",VLOOKUP(M$2,Constantes!$B$23:$N$303,2))","v":"Ácido ascórbico"},{"$f":"IF(VLOOKUP(N$2,Constantes!$B$23:$N$303,2)=\"\",\"\",VLOOKUP(N$2,Constantes!$B$23:$N$303,2))","v":"Ácido acético"},{"$f":"IF(VLOOKUP(O$2,Constantes!$B$23:$N$303,2)=\"\",\"\",VLOOKUP(O$2,Constantes!$B$23:$N$303,2))","v":"Hidróxido de amônio"},{"$f":"IF(VLOOKUP(P$2,Constantes!$B$23:$N$303,2)=\"\",\"\",VLOOKUP(P$2,Constantes!$B$23:$N$303,2))","v":"Ácido carbônico"},{"$f":"IF(VLOOKUP(Q$2,Constantes!$B$23:$N$303,2)=\"\",\"\",VLOOKUP(Q$2,Constantes!$B$23:$N$303,2))","v":"Ácido clorídrico"},null,null,"Verifique se o  Solver já está instalado (o local depende da versão do Excel)"]
["[B]",{"$f":"IF(K5=\"\",0,(B$11)/M$41)","v":8.8196522951089944E-8},3.6633833110247455E-9,0,0,0,{"$f":"IF(P5=\"\",0,(G$11)/R$41)","v":0},0,null,"Carga de B",-3,-1,-2,-1,0,-2,-1,-1,-1,-2,"Carga de B",{"$f":"IF(K4=\"\",\"\",K4)","v":-3},{"$f":"IF(L4=\"\",\"\",L4)","v":-1},-2,-1,0,-2,-1,-1,-1,-2,"Carga de B",{"$f":"IF(VLOOKUP(K$2,Constantes!$B$23:$N$303,3)=\"\",\"\",VLOOKUP(K$2,Constantes!$B$23:$N$303,3))","v":-3},{"$f":"IF(VLOOKUP(L$2,Constantes!$B$23:$N$303,3)=\"\",\"\",VLOOKUP(L$2,Constantes!$B$23:$N$303,3))","v":0},{"$f":"IF(VLOOKUP(M$2,Constantes!$B$23:$N$303,3)=\"\",\"\",VLOOKUP(M$2,Constantes!$B$23:$N$303,3))","v":-2},{"$f":"IF(VLOOKUP(N$2,Constantes!$B$23:$N$303,3)=\"\",\"\",VLOOKUP(N$2,Constantes!$B$23:$N$303,3))","v":-1},{"$f":"IF(VLOOKUP(O$2,Constantes!$B$23:$N$303,3)=\"\",\"\",VLOOKUP(O$2,Constantes!$B$23:$N$303,3))","v":0},{"$f":"IF(VLOOKUP(P$2,Constantes!$B$23:$N$303,3)=\"\",\"\",VLOOKUP(P$2,Constantes!$B$23:$N$303,3))","v":-2},{"$f":"IF(VLOOKUP(Q$2,Constantes!$B$23:$N$303,3)=\"\",\"\",VLOOKUP(Q$2,Constantes!$B$23:$N$303,3))","v":-1},null,null,"Na aba Dados, bem à direita, no grupo Análise ( Excel 2007, 2010 e 2013)"]
["[HB]",{"$f":"IF(K5=\"\",0,(B$11*(V$5*$AU41^(-2*V$4))*$D41)/M$41)","v":1.7115234241092185E-4},2.6263159553905069E-2,0,0,0,0,0,null,"pKa1",3.1280000000000001,2.35,4.0999999999999996,4.7569999999999997,9.2439999999999998,6.3520000000000003,-7,-6,13.997,6.3520000000000003,"bp1",{"$f":"IF(K5=\"\",\"1E-10\",IF(K6=\"\",10^K5,(IF(K7=\"\",10^K6,(IF(K8=\"\",10^K7,(IF(K9=\"\",10^K8,(IF(K10=\"\",10^K9,10^K10))))))))))","v":2488857.3182823951},{"$f":"IF(L5=\"\",\"1E-10\",IF(L6=\"\",10^L5,(IF(L7=\"\",10^L6,(IF(L8=\"\",10^L7,(IF(L9=\"\",10^L8,(IF(L10=\"\",10^L9,10^L10))))))))))","v":5997910762.5551224},616595001861.48279,57147.863667186728,1753880501.8417609,21330449131.465843,9.9999999999999995E-8,{"$f":"IF(R5=\"\",\"1E-10\",IF(R6=\"\",10^R5,10^R6))","v":9.9999999999999995E-7},{"$f":"IF(S5=\"\",\"1E-10\",IF(S6=\"\",10^S5,10^S6))","v":99311604842093.641},{"$f":"IF(T5=\"\",\"1E-10\",IF(T6=\"\",10^T5,10^T6))","v":21330449131.465843},"pKa1 = logKpn",{"$f":"IF(VLOOKUP(K$2,Constantes!$B$23:$N$303,4)=\"\",\"\",VLOOKUP(K$2,Constantes!$B$23:$N$303,4))","v":3.1280000000000001},{"$f":"IF(VLOOKUP(L$2,Constantes!$B$23:$N$303,4)=\"\",\"\",VLOOKUP(L$2,Constantes!$B$23:$N$303,4))","v":4.43},{"$f":"IF(VLOOKUP(M$2,Constantes!$B$23:$N$303,4)=\"\",\"\",VLOOKUP(M$2,Constantes!$B$23:$N$303,4))","v":4.0999999999999996},{"$f":"IF(VLOOKUP(N$2,Constantes!$B$23:$N$303,4)=\"\",\"\",VLOOKUP(N$2,Constantes!$B$23:$N$303,4))","v":4.7569999999999997},{"$f":"IF(VLOOKUP(O$2,Constantes!$B$23:$N$303,4)=\"\",\"\",VLOOKUP(O$2,Constantes!$B$23:$N$303,4))","v":9.2439999999999998},{"$f":"IF(VLOOKUP(P$2,Constantes!$B$23:$N$303,4)=\"\",\"\",VLOOKUP(P$2,Constantes!$B$23:$N$303,4))","v":6.3520000000000003},{"$f":"IF(VLOOKUP(Q$2,Constantes!$B$23:$N$303,4)=\"\",\"\",VLOOKUP(Q$2,Constantes!$B$23:$N$303,4))","v":-7},null,null,"ou na aba Ferramentas (versões anteriores a 2007)"]
["[H2B]",{"$f":"IF(K6=\"\",0,(B$11*(V$6*$AU41^(-4*V$4-2))*$D41^2)/M$41)","v":9.5297354324039019E-3},8.7011808357788448E-3,0,0,0,0,0,null,"pKa2",4.7610000000000001,9.7780000000000005,11.79,"","",10.329000000000001,"",null,null,10.329000000000001,"bp2",{"$f":"IF(K6=\"\",\"1E-10\",IF(K7=\"\",V5*10^K5,(IF(K8=\"\",V5*10^K6,(IF(K9=\"\",V5*10^K7,(IF(K10=\"\",V5*10^K8,V5*10^K9))))))))","v":143548943335.36603},{"$f":"IF(L6=\"\",\"1E-10\",IF(L7=\"\",W5*10^L5,(IF(L8=\"\",W5*10^L6,(IF(L9=\"\",W5*10^L7,(IF(L10=\"\",W5*10^L8,W5*10^L9))))))))","v":1342764961137.8711},7762471166286925,"1E-10","1E-10",4.7973344863669224E+16,"1E-10",{"$f":"IF(R6=\"\",\"1E-10\",AC5*10^R5)","v":"1E-10"},{"$f":"IF(S6=\"\",\"1E-10\",AD5*10^S5)","v":"1E-10"},{"$f":"IF(T6=\"\",\"1E-10\",AE5*10^T5)","v":4.7973344863669224E+16},"pKa2 = logKpn-1",{"$f":"IF(VLOOKUP(K$2,Constantes!$B$23:$N$303,5)=\"\",\"\",VLOOKUP(K$2,Constantes!$B$23:$N$303,5))","v":4.7610000000000001},{"$f":"IF(VLOOKUP(L$2,Constantes!$B$23:$N$303,5)=\"\",\"\",VLOOKUP(L$2,Constantes!$B$23:$N$303,5))","v":""},{"$f":"IF(VLOOKUP(M$2,Constantes!$B$23:$N$303,5)=\"\",\"\",VLOOKUP(M$2,Constantes!$B$23:$N$303,5))","v":11.79},{"$f":"IF(VLOOKUP(N$2,Constantes!$B$23:$N$303,5)=\"\",\"\",VLOOKUP(N$2,Constantes!$B$23:$N$303,5))","v":""},{"$f":"IF(VLOOKUP(O$2,Constantes!$B$23:$N$303,5)=\"\",\"\",VLOOKUP(O$2,Constantes!$B$23:$N$303,5))","v":""},{"$f":"IF(VLOOKUP(P$2,Constantes!$B$23:$N$303,5)=\"\",\"\",VLOOKUP(P$2,Constantes!$B$23:$N$303,5))","v":10.329000000000001},{"$f":"IF(VLOOKUP(Q$2,Constantes!$B$23:$N$303,5)=\"\",\"\",VLOOKUP(Q$2,Constantes!$B$23:$N$303,5))","v":""}]
["[H3B]",{"$f":"IF(K7=\"\",0,(B$11*(V$7*$AU41^(-6*V$4-6))*$D41^3)/M$41)","v":1.5294858141103884E-2},0,0,0,0,0,0,null,"pKa3",6.3959999999999999,"","","","","","",null,null,null,"bp3",{"$f":"IF(K7=\"\",\"1E-10\",IF(K8=\"\",V6*10^K5,(IF(K9=\"\",V6*10^K6,(IF(K10=\"\",V6*10^K7,V6*10^K8))))))","v":192752491319094.31},{"$f":"IF(L7=\"\",\"1E-10\",IF(L8=\"\",W6*10^L5,(IF(L9=\"\",W6*10^L6,(IF(L10=\"\",W6*10^L7,W6*10^L8))))))","v":"1E-10"},"1E-10","1E-10","1E-10","1E-10","1E-10",null,null,null,"pKa3 = logKpn-2",{"$f":"IF(VLOOKUP(K$2,Constantes!$B$23:$N$303,6)=\"\",\"\",VLOOKUP(K$2,Constantes!$B$23:$N$303,6))","v":6.3959999999999999},{"$f":"IF(VLOOKUP(L$2,Constantes!$B$23:$N$303,6)=\"\",\"\",VLOOKUP(L$2,Constantes!$B$23:$N$303,6))","v":""},{"$f":"IF(VLOOKUP(M$2,Constantes!$B$23:$N$303,6)=\"\",\"\",VLOOKUP(M$2,Constantes!$B$23:$N$303,6))","v":""},{"$f":"IF(VLOOKUP(N$2,Constantes!$B$23:$N$303,6)=\"\",\"\",VLOOKUP(N$2,Constantes!$B$23:$N$303,6))","v":""},{"$f":"IF(VLOOKUP(O$2,Constantes!$B$23:$N$303,6)=\"\",\"\",VLOOKUP(O$2,Constantes!$B$23:$N$303,6))","v":""},{"$f":"IF(VLOOKUP(P$2,Constantes!$B$23:$N$303,6)=\"\",\"\",VLOOKUP(P$2,Constantes!$B$23:$N$303,6))","v":""},{"$f":"IF(VLOOKUP(Q$2,Constantes!$B$23:$N$303,6)=\"\",\"\",VLOOKUP(Q$2,Constantes!$B$23:$N$303,6))","v":""},null,null,"Para instalar o Solver no Excel 2007, 2010 e 2013"]
["[H4B]",{"$f":"IF(K8=\"\",0,(B$11*(V$8*$AU41^(-8*V$4-12))*$D41^4)/M$41)","v":0},0,0,0,0,0,0,null,"pKa4","","","","","","","","pKw",null,null,"bp4",{"$f":"IF(K8=\"\",\"1E-10\",IF(K9=\"\",V7*10^K5,(IF(K10=\"\",V7*10^K6,V7*10^K7))))","v":"1E-10"},{"$f":"IF(L8=\"\",\"1E-10\",IF(L9=\"\",W7*10^L5,(IF(L10=\"\",W7*10^L6,W7*10^L7))))","v":"1E-10"},"1E-10","1E-10","1E-10","1E-10","1E-10","Kw",null,null,"pKa4 = logKpn-3",{"$f":"IF(VLOOKUP(K$2,Constantes!$B$23:$N$303,7)=\"\",\"\",VLOOKUP(K$2,Constantes!$B$23:$N$303,7))","v":""},{"$f":"IF(VLOOKUP(L$2,Constantes!$B$23:$N$303,7)=\"\",\"\",VLOOKUP(L$2,Constantes!$B$23:$N$303,7))","v":""},{"$f":"IF(VLOOKUP(M$2,Constantes!$B$23:$N$303,7)=\"\",\"\",VLOOKUP(M$2,Constantes!$B$23:$N$303,7))","v":""},{"$f":"IF(VLOOKUP(N$2,Constantes!$B$23:$N$303,7)=\"\",\"\",VLOOKUP(N$2,Constantes!$B$23:$N$303,7))","v":""},{"$f":"IF(VLOOKUP(O$2,Constantes!$B$23:$N$303,7)=\"\",\"\",VLOOKUP(O$2,Constantes!$B$23:$N$303,7))","v":""},{"$f":"IF(VLOOKUP(P$2,Constantes!$B$23:$N$303,7)=\"\",\"\",VLOOKUP(P$2,Constantes!$B$23:$N$303,7))","v":""},{"$f":"IF(VLOOKUP(Q$2,Constantes!$B$23:$N$303,7)=\"\",\"\",VLOOKUP(Q$2,Constantes!$B$23:$N$303,7))","v":""},null,null,"1.Abra o Excel com uma planilha em branco"]
["[H5B]",{"$f":"IF(K9=\"\",0,(B$11*(V$9*$AU41^(-10*V$4-20))*$D41^5)/M$41)","v":0},0,0,0,0,0,0,"Total","pKa5","","","","","","","",13.997,null,null,"bp5",{"$f":"IF(K9=\"\",\"1E-10\",IF(K10=\"\",V8*10^K5,V8*10^K6))","v":"1E-10"},{"$f":"IF(L9=\"\",\"1E-10\",IF(L10=\"\",W8*10^L5,W8*10^L6))","v":"1E-10"},"1E-10","1E-10","1E-10","1E-10","1E-10",{"$f":"10^-R9","v":1.0069316688518014E-14},null,null,"pKa5 = logKpn-4",{"$f":"IF(VLOOKUP(K$2,Constantes!$B$23:$N$303,8)=\"\",\"\",VLOOKUP(K$2,Constantes!$B$23:$N$303,8))","v":""},{"$f":"IF(VLOOKUP(L$2,Constantes!$B$23:$N$303,8)=\"\",\"\",VLOOKUP(L$2,Constantes!$B$23:$N$303,8))","v":""},{"$f":"IF(VLOOKUP(M$2,Constantes!$B$23:$N$303,8)=\"\",\"\",VLOOKUP(M$2,Constantes!$B$23:$N$303,8))","v":""},{"$f":"IF(VLOOKUP(N$2,Constantes!$B$23:$N$303,8)=\"\",\"\",VLOOKUP(N$2,Constantes!$B$23:$N$303,8))","v":""},{"$f":"IF(VLOOKUP(O$2,Constantes!$B$23:$N$303,8)=\"\",\"\",VLOOKUP(O$2,Constantes!$B$23:$N$303,8))","v":""},{"$f":"IF(VLOOKUP(P$2,Constantes!$B$23:$N$303,8)=\"\",\"\",VLOOKUP(P$2,Constantes!$B$23:$N$303,8))","v":""},{"$f":"IF(VLOOKUP(Q$2,Constantes!$B$23:$N$303,8)=\"\",\"\",VLOOKUP(Q$2,Constantes!$B$23:$N$303,8))","v":""},null,null,"2. Clique no canto superior esquerdo em Arquivo (ou no botão do Office, no Windows XP)"]
["[H6B]",{"$f":"IF(K10=\"\",0,(B$11*(V$10*$AU41^(-12*V$4-30))*$D41^6)/M$41)","v":0},0,0,0,0,0,0,"SS","pKa6","","","","","","","",null,null,null,"bp6",{"$f":"IF(K10=\"\",\"1E-10\",V9*10^K5)","v":"1E-10"},{"$f":"IF(L10=\"\",\"1E-10\",W9*10^L5)","v":"1E-10"},"1E-10","1E-10","1E-10","1E-10","1E-10",null,null,null,"pKa6 = logKpn-5",{"$f":"IF(VLOOKUP(K$2,Constantes!$B$23:$N$303,9)=\"\",\"\",VLOOKUP(K$2,Constantes!$B$23:$N$303,9))","v":""},{"$f":"IF(VLOOKUP(L$2,Constantes!$B$23:$N$303,9)=\"\",\"\",VLOOKUP(L$2,Constantes!$B$23:$N$303,9))","v":""},{"$f":"IF(VLOOKUP(M$2,Constantes!$B$23:$N$303,9)=\"\",\"\",VLOOKUP(M$2,Constantes!$B$23:$N$303,9))","v":""},{"$f":"IF(VLOOKUP(N$2,Constantes!$B$23:$N$303,9)=\"\",\"\",VLOOKUP(N$2,Constantes!$B$23:$N$303,9))","v":""},{"$f":"IF(VLOOKUP(O$2,Constantes!$B$23:$N$303,9)=\"\",\"\",VLOOKUP(O$2,Constantes!$B$23:$N$303,9))","v":""},{"$f":"IF(VLOOKUP(P$2,Constantes!$B$23:$N$303,9)=\"\",\"\",VLOOKUP(P$2,Constantes!$B$23:$N$303,9))","v":""},{"$f":"IF(VLOOKUP(Q$2,Constantes!$B$23:$N$303,9)=\"\",\"\",VLOOKUP(Q$2,Constantes!$B$23:$N$303,9))","v":""},null,null,"3. Clique em Opções no canto inferior esquerdo",null,null,null,"(no Windows for Mac, pule etapa 2 e clique Ferramentas)"]
["S[HiB]",2.4995834112441658E-2,3.4964344053067226E-2,0,0,0,0,0,{"$f":"SUM(B11:H11)","v":5.9960178165508887E-2},"SS[bases]",null,null,null,"  Correção da calibração do sensor de pH",null,null,"        Força iônica, I (inicial)",null,"Amostra","Titulante",null,null,null,null,"   Constantes cumulativas recalculadas para  I inicial =",{"$f":"AT41","v":1.0862225451938132E-2}," g H+=",{"$f":"S23","v":0.89870403891190154},"recalc. para"," g H+=",0.78159398185987139,null,null,null,null,null,null,null,null,null,null,"4.Clique em Suplementos (na coluna esquerda)"]
["S[H] ligado",{"$f":"B5+2*B6+3*B7+4*B8+5*B9+6*B10","v":6.5115197630530378E-2},4.3665521225462758E-2,0,0,0,0,0,{"$f":"SUM(B12:H12)","v":0.10878071885599314},"SS[H] ligado no pH inicial do titulado",null,null,null,"intersecção (ajustar opcionalmente)",null,7,"Outros íons","SCk(z=1)",0,0,"bp1",{"$f":"IF(K5=\"\",\"\",(V5*$AB$11^(-2*V$4)))","v":1311294.2621988214},4844326285.1269093,402222882407.81342,46156.555017478473,1753880501.8417609,13914473368.758875,8.0766894955656463E-8,6.1088915247956897E-7,3395958805837007,7960215532.0210819,null,null,null,null,null,null,null,null,null,null,"5. Clique sobre a linha do Solver na lista de suplementos"]
["[H] liberável",{"$f":"IF(K4=\"\",\"0\",(-K4*B11)-B12)","v":9.8723047067945935E-3},{"$f":"IF(L4=\"\",\"0\",(-L4*C11)-C12)","v":-8.7011771723955328E-3},0,0,0,0,0,{"$f":"SUM(B13:H13)","v":1.1711275343990607E-3},"SS[H] max. H+ livre (pode ser negativo)",null,null,null,"inclinação (ajustar opcionalmente)",null,1,"mol/L","SCk(z=2)",0,0,"bp2",{"$f":"IF(K6=\"\",\"\",(V6*$AB$11^(-4*V$4-2)))","v":49336340732.100609},{"$f":"IF(L6=\"\",\"\",(W6*$AB$11^(-4*W$4-2)))","v":1084509565663.5857},4089782016054045,"","",2.527552358912568E+16,"",null,null,1.0936723698247162E+16,null,null,null,null,null,null,null,null,null,null,"6. Clique em Ir (em baixo, depois de \"Gerenciar suplementos\")"]
["TITULANTE",{"$f":"R3","v":"Ácido forte"},{"$f":"S3","v":"Base forte"},{"$f":"T3","v":"Ác. carbônico"},null,"Volume de Titulado (mL)",null,"Amostra",{"$f":"I18-(I12+I13)","v":4.9721207806857626E-5},"Balanço parcial de carga <---> contra-íons (sinal oposto)",null,null,{"$f":"S15","v":-3.0876854648886854E-4},null," Parâmetros da eq. de Davies",null,"(z = carga do íon)","1/2.SCkzk2 = Ik",{"$f":"0.5*(S12+S13*4)","v":0},{"$f":"0.5*(T12+T13*4)","v":0},"bp3",{"$f":"IF(K7=\"\",\"\",(V7*$AB$11^(-6*V$4-6)))","v":53505733458800.852},{"$f":"IF(L7=\"\",\"\",(W7*$AB$11^(-6*W$4-6)))","v":""},"","","","","",null,null,null,null,null,null,null,null,null,null,null,null,null,"7. Marque o Solver na nova janela "]
["[B]",null,0.1,null,"AMOSTRA","Água","Titulado","Titulado: [H]=10-p[H]",{"$f":"D41","v":1.4798960893122632E-3},{"$f":"IF(C41=\"\",B41,C41)","v":2.8840165138244629}," pH inicial",null,null,null,"para estimar  coef. de atividade",null,"Mínimo","SzjCj",{"$f":"-(S18/S17) - (G16/E16)*(S24- $AC$9/AU41^2/S24)","v":-3.0876854648886854E-4},{"$f":"-T18/T17 - (T24- $AC$9/AE11^2/T24)","v":9.9999989519874585E-2},"bp4",{"$f":"IF(K8=\"\",\"\",(V8*$AB$11^(-8*V$4-12)))","v":""},{"$f":"IF(L8=\"\",\"\",(W8*$AB$11^(-8*W$4-12)))","v":""},"","","","","",null,null,null,null,null,null,null,null,null,null,null,null,null,"8. Clique OK; basta seguir de 1 a 8 uma única vez em cada computador"]
["[HB]",null,null,null,20,0,{"$f":"E16+F16","v":20},"Titulado: [OH]=Kw/[H]",{"$f":"AB21/I15","v":8.424330382003591E-12},{"$f":"-LOG(AB21)-J15","v":11.020216873135789}," pOH inicial  na  força  iônica,  I",null,{"$f":"AT41","v":1.0862225451938132E-2},null,"A ",0.50900000000000001,"de contra-íons","1/2.SCjzj2 = Ij",{"$f":"0.5*S17^2*ABS(S15)","v":1.5438427324443427E-4},{"$f":"0.5*T17^2*ABS(T15)","v":4.9999994759937293E-2},"bp5",{"$f":"IF(K9=\"\",\"\",(V9*$AB$11^(-10*V$4-20)))","v":""},{"$f":"IF(L9=\"\",\"\",(W9*$AB$11^(-10*W$4-20)))","v":""},"","","","","",null,null,null,null,null,null,null,null,null,null,null,null,null,"9. Abra o arquivo do CurTiPot e clique na aba Regressão"]
["[H2B]",null,null,null,"SS",null,null,"Amostra: CHcalc",{"$f":"I12+ (G16/E16)*(I15-I16)","v":0.11026061493688107},null,null,null,null,null,"b",0.3,"para ácidos/bases","carga contra-íon",1,1,"bp6",{"$f":"IF(K10=\"\",\"\",(V10*$AB$11^(-12*V$4-30)))","v":""},{"$f":"IF(L10=\"\",\"\",(W10*$AB$11^(-12*W$4-30)))","v":""},"","","","","",null,null,null,null,null,null,null,null,null,null,null,null,null,"10. Clique na aba Dados e localize o Solver à direita, no grupo Análise"]
["S[HiB]",{"$f":"B15+B16+B17","v":0},{"$f":"C15+C16+C17","v":0.1},{"$f":"D15+D16+D17","v":0},{"$f":"SUM(B18:D18)","v":0.1},"SS[HiB]",null,"Amostra: CHreg",0.11000156759819905,"<---Solver: ajustar CHReg, concentrações (B11 a G11, azul) e/ou pKas",null,null,null,null,null,null,"íons de ácidos/bases","SziCi",{"$f":"SUM(V18:AB18)","v":-1.1711275343990642E-3},{"$f":"SUM(AC18:AE18)","v":-1.7801316650853212E-4},"SziCi",{"$f":"K4*B4+(K4+1)*B5+(K4+2)*B6+(K4+3)*B7+(K4+4)*B8+(K4+5)*B9+(K4+6)*B10","v":-9.8723047067945987E-3},8.7011771723955345E-3,0,0,0,0,0,0,-1.7801316650853212E-4,0,null,null,null,null,null,null,null,null,null,null,null,"(ou localizar o Solver na aba Ferramentas, no Excel antigo)"]
["S[H]",{"$f":"B16+2*B17","v":0},{"$f":"C16+2*C17","v":0},{"$f":"D16+2*D17","v":0},{"$f":"SUM(B19:D19)","v":0},"SS [H]         pH",12.889207370986353,"S(|RCH|a×|dpH|b×|RpH|c)",{"$f":"SUM($G$41:$G$201)","v":2.1341272868223785E-6},"<---Solver: minimizar S do produto dos resíduos ponderados",null,null,null,null,null,null,"no pH da solução","1/2.SCizi2 = Ii",{"$f":"0.5*SUM(V19:AB19)","v":9.4581615349581521E-3},{"$f":"0.5*(SUM(AC19:AE19))","v":8.9006583254266059E-5},"Szi2Ci",{"$f":"V4^2*B4+(V4+1)^2*B5+(V4+2)^2*B6+(V4+3)^2*B7+(V4+4)^2*B8+(V4+5)^2*B9+(V4+6)^2*B10","v":1.0215138570754149E-2},8.701184499162155E-3,0,0,0,0,0,0,1.7801316650853212E-4,0,null,null,null,null,null,null,null,null,null,null,"11. Clique em Solver para utilizá-lo"]
[null,null,null,null,null,null,null,"Pesos: expoente a ",2,"expoente b  ",0,"expoente c ",0,null,null,null," I Total","I = Ii+Ij+Ik+IH+IOH",{"$f":"S19+S16+S14+0.5*S24/L41+0.5*S25/L41","v":1.0352493857070884E-2},{"$f":"T19+T16+T14+0.5*T24+0.5*T25","v":9.9999989520039703E-2},null,null,null,null,null,null,null,"Kw","Kw"]
[null,null,null,null,null,null,null,null,null,null,null,null,null,null,null,null,"Ação","Parâmetro","Titulado","Titulante",null,null,null,null,null,null,null,{"$f":"AC9/S23^2","v":1.2467133587401598E-14},{"$f":"AC9/T23^2","v":1.6483050398991624E-14},null,null,null,null,null,null,null,null,null,null,null,null,"Nas versões anteriores do Excel:"]
[null,null,null,null,null,null,null,null,null,null,null,null,null,null,null,null,null,"I",{"$f":"AT41","v":1.0862225451938132E-2},9.9999932445251433E-2,null,null,null,null,null,null,null,null,null,null,null,null,null,null,null,null,null,null,null,null,null,"Feche o CurTiPot e abra uma planilha em branco"]
[null,null,null,null,null,null,null,null,null,null,null,null,null,"     Resíduos de CHreg - CHcalc",null,null,null,"g H+",{"$f":"AU41","v":0.89870403891190154},0.78159398185987139,null,null,null,null,null,null,null,null,null,null,null,null,null,null,null,null,null,null,null,null,null,"Em Ferramentas/Suplementos, assinale Solver na lista. "]
[null,null,null,null,null,null,null,null,null,null,null,null,null,"Média",{"$f":"AVERAGE(H41:H201)","v":8.6327925089790262E-6},null,null,"[H+]",{"$f":"D41","v":1.4798960893122632E-3},1.65124464582979E-13,null,null,null,null,null,null,null,null,null,null,null,null,null,null,null,null,null,null,null,null,null,"Se os arquivos estiverem faltando, localizá-los no CD do Office"]
[null,null,null,null,null,null,null,null,null,null,null,null,null,"Mediana",{"$f":"MEDIAN(H41:H201)","v":-7.9869936772808403E-6},null,null,"[OH-]",{"$f":"AB21/D41","v":8.424330382003591E-12},9.9821976353531169E-2,null,null,null,null,null,null,null,null,null,null,null,null,null,null,null,null,null,null,null,null,null,"Só depois que o Solver aparecer na lista Ferramentas, abrir o CurTiPot."]
[null,null,null,null,null,null,null,null,null,null,null,null,null,"Desvio Padrão",{"$f":"STDEV(H42:H201)","v":1.7262507510531038E-4},null,null,"pH",{"$f":"IF(C41=\"\",B41,C41)","v":2.8840165138244629},12.889207370986353]
[null,null,null,null,null,null,null,null,null,null,null,null,null,"DPR, %",{"$f":"100*O26/I17","v":0.15656095805753487},null,null,null,null,null,null,null,null,null,null,null,null,null,null,null,null,null,null,null,null,null,null,null,null,null,null,"Para aprender com os autores do Excel Solver sobre a configuração, os usos e as limitações"]
[null,null,null,null,null,null,null,null,null,null,null,null,null,null,null,null,null,null,null,null,null,null,null,null,null,null,null,null,null,null,null,null,null,null,null,null,null,null,null,null,null,"do método generalizado dos gradientes reduzidos para otimização não linear, consulte"]
[null,null,null,null,null,null,null,null,null,null,null,null,null,null,null,null,null,"código de cores",null,null,null,null,null,null,null,null,null,null,null,null,null,null,null,null,null,null,null,null,null,null,null,"https://www.solver.com/excel-solver-online-help"]
[null,null,null,null,null,null,null,null,null,null,null,null,null,null,null,null,null,"N ã o    a l t e r e  ",null,null,null,null,null,null,null,null,null,null,null,null,null,null,null,null,null,null,null,null,null,null,null,"https://faculty.insead.edu/delquie/msp/Download%20Solutions/Design%20and%20Use%20of%20Solver.pdf"]
[null,null,null,null,null,null,null,null,null,null,null,null,null,"     Resíduos de pHreg - pH",null,null,null," M u d e   c r I t e r o s a m e n t e"]
[null,null,null,null,null,null,null,null,null,null,null,null,null,"Média",{"$f":"AVERAGE(F41:F201)","v":-7.2147839180903666E-5},null,null,"Preencha, altere ou deixe em branco"]
[null,null,null,null,null,null,null,null,null,null,null,null,null,"Mediana",{"$f":"MEDIAN(F41:F201)","v":5.8233969963872312E-4}]
[null,null,null,null,null,null,null,null,null,null,null,null,null,"Desvio Padrão",{"$f":"STDEV(F41:F201)","v":1.8860157050667424E-2}]
[]
[]
[]
["     Planilha para 160 pontos; pode ser ampliada ou abreviada para ganhar velocidade",null,null,null,null,null,"     Para ler dados nas curvas, mudar escalas e copiar curvas para outros documentos, leia comentários nas células  Q44 a Q46 da planilha Analise I"]
["Vol. Adicion.","pH medido","pH ajustado","[H]","dpH/dV","pHreg-pH","Fator de","CHReg-CHcalc","CHReg","CHcalc","Dil ttlante.","Dil ttlado.","den1","den2","den3","den4","den5","den6","den7","den1 tlante.","den2 tlante.","den3 tlante.","h1","h2","h3","h4","h5","h6","h7","h1 ttlante.","h2 ttlante.","h3 ttlante.","I1","I2","I3","I4","I5","I6","I7","I1 ttlante.","I2 ttlante.","I3 ttlante.","Iparcial","Itotal","Clicar C22","Itotal","g H+",null,"pHReg- pH","Excluir"]
["(mL)","ou simulado","por regressão","mol/L","p/ ponderação","p/ ponderação","ponderação","mol/L","mol/L","mol/L",null,null,{"$f":"K3","v":"Ácido cítrico"},"Glicina","Ácido ascórbico","Ácido acético","Hidróxido de amônio","Ácido carbônico","Ácido clorídrico","Ácido forte","Base forte","Ác. carbônico",{"$f":"K3","v":"Ácido cítrico"},"Glicina","Ácido ascórbico","Ácido acético","Hidróxido de amônio","Ácido carbônico","Ácido clorídrico","Ácido forte","Base forte","Ác. carbônico",{"$f":"K3","v":"Ácido cítrico"},"Glicina","Ácido ascórbico","Ácido acético","Hidróxido de amônio","Ácido carbônico","Ácido clorídrico",{"$f":"R3","v":"Ácido forte"},{"$f":"S3","v":"Base forte"},{"$f":"T3","v":"Ác. carbônico"},"mol/L","mol/L","para atualizar AT -->","aplicado mol/L",null,null,null,"com X"]
[0,2.8761520839780119,2.8840165138244629,{"$f":"IF(A41=\"\",\"\",10^-((((B41-P$12)/P$13)+7))/$AU41)","v":1.4798960893122632E-3},{"$f":"IF(A42=\"\",\"0\",(B42-B41)/(A42-A41))","v":0.16000916606103358},{"$f":"IF(A41=\"\",\"\",IF(C41=\"\",\"0,00001\",(IF(ABS(C41-B41)<0.00001,0.00001,C41-B41))))","v":7.864429846450971E-3},{"$f":"IF(A41=\"\",\"\",IF(AX41=\"X\",0,IF(ABS(E41)<0.00001,(0.00001^K$20)*(ABS(H41)^I$20)*ABS(F41)^M$20,((ABS(E41))^K$20)*((ABS(H41))^I$20)*ABS(F41)^M$20)))","v":6.710552367824707E-8},{"$f":"IF(A41=\"\",\"\",I41-J41)","v":-2.5904733868203911E-4},{"$f":"IF(A41=\"\",\"\",L41*I$18+K41*E$19)","v":0.11000156759819905},{"$f":"IF(A41=\"\",\"\",D41 -$AC$9/AU41^2/D41+L41*(W41*$B$11+X41*$C$11+Y41*$D$11+Z41*$E$11+AA41*$F$11+AB41*$G$11+AC41*$H$11)+K41*(AD41*$B$18+AE41*$C$18+AF41*$D$18))","v":0.11026061493688109},{"$f":"IF(A41=\"\",\"\",A41/(A41+$G$16))","v":0},{"$f":"IF(A41=\"\",\"\",$E$16/(A41+$G$16))","v":1},{"$f":"IF($A41=\"\",\"\",(1+(V$5*$AU41^(-2*V$4))*$D41+(V$6*$AU41^(-4*V$4-2))*$D41^2+(V$7*$AU41^(-6*V$4-6))*$D41^3+(V$8*$AU41^(-8*V$4-12))*$D41^4+(V$9*$AU41^(-10*V$4-20))*$D41^5+(V$10*$AU41^(-12*V$4-30))*$D41^6))","v":283410.65243924968},9544276.7203322686,9552248726.5276833,69.306905266492706,2595561.8957966515,55376324983.019279,1.0000000001195268,{"$f":"IF($A41=\"\",\"\",(1+(AC$5*$AU41^(-2*AC$4))*$D41+(AC$6*$AU41^(-4*AC$4-2))*$D41^2))","v":1.0000000011952663},{"$f":"IF($A41=\"\",\"\",(1+(AD$5*$AU41^(-2*AD$4))*$D41+(AD$6*$AU41^(-4*AD$4-2))*$D41^2))","v":118703796582.41637},{"$f":"IF($A41=\"\",\"\",(1+(AE$5*$AU41^(-2*AE$4))*$D41+(AE$6*$AU41^(-4*AE$4-2))*$D41^2))","v":55376324983.019279},{"$f":"IF($A41=\"\",\"\",((V$5*$AU41^(-2*V$4))*$D41+2*(V$6*$AU41^(-4*V$4-2))*$D41^2+3*(V$7*$AU41^(-6*V$4-6))*$D41^3+4*(V$8*$AU41^(-8*V$4-12))*$D41^4+5*(V$9*$AU41^(-10*V$4-20))*$D41^5+6*(V$10*$AU41^(-12*V$4-30))*$D41^6)/M41)","v":2.6050419977031032},1.2488585845966196,1.9376850321061931,0.98557142327802849,0.99999961472696852,1.9996281447580788,1.1952696672569927E-10,{"$f":"IF($A41=\"\",\"\",((AC$5*$AU41^(-2*AC$4))*$D41+2*(AC$6*$AU41^(-4*AC$4-2))*$D41^2)/T41)","v":1.1952664722529732E-9},{"$f":"IF($A41=\"\",\"\",((AD$5*$AU41^(-2*AD$4))*$D41+2*(AD$6*$AU41^(-4*AD$4-2))*$D41^2)/U41)","v":0.99999999999157563},{"$f":"IF($A41=\"\",\"\",((AE$5*$AU41^(-2*AE$4))*$D41+2*(AE$6*$AU41^(-4*AE$4-2))*$D41^2)/V41)","v":1.9996281447580788},{"$f":"IF(B$11=0,\"\",IF($A41=\"\",\"\",0.5*B$11*$L41*(1*V$4^2+(V$5*$AU41^(-2*V$4))*$D41*(V$4+1)^2+(V$6*$AU41^(-4*V$4-2))*$D41^2*(V$4+2)^2+(V$7*$AU41^(-6*V$4-6))*$D41^3*(V$4+3)^2+(V$8*$AU41^(-8*V$4-12))*$D41^4*(V$4+4)^2+(V$9*$AU41^(-10*V$4-20))*$D41^5*(V$4+5)^2+(V$10*$AU41^(-12*V$4-30))*$D41^6*(V$4+6)^2)/M41))","v":5.1075692853770746E-3},4.3505922495810792E-3,"","","","","",{"$f":"IF(B$18=0,\"\",IF($A41=\"\",\"\",0.5*B$18*$K41*(1*AC$4^2+(AC$5*$AU41^(-2*AC$4))*$D41*(AC$4+1)^2+(AC$6*$AU41^(-4*AC$4-2))*$D41^2*(AC$4+2)^2)/T41))","v":""},{"$f":"IF(C$18=0,\"\",IF($A41=\"\",\"\",0.5*C$18*$K41*(1*AD$4^2+(AD$5*$AU41^(-2*AD$4))*$D41*(AD$4+1)^2+(AD$6*$AU41^(-4*AD$4-2))*$D41^2*(AD$4+2)^2)/U41))","v":0},{"$f":"IF(D$18=0,\"\",IF($A41=\"\",\"\",0.5*D$18*$K41*(1*AE$4^2+(AE$5*$AU41^(-2*AE$4))*$D41*(AE$4+1)^2+(AE$6*$AU41^(-4*AE$4-2))*$D41^2*(AE$4+2)^2)/V41))","v":""},{"$f":"IF(A41=\"\",\"\",SUM(AG41:AP41)+0.5*(D41+ $AC$9/AU41^2/D41)+$L41*$S$16+$K41*$T$16)","v":1.0352493857070886E-2},{"$f":"IF(A41=\"\",\"\",AQ41+$L41*S$14+$K41*$T$14)","v":1.0352493857070886E-2},null,1.0862225451938132E-2,{"$f":"IF(A41=\"\",\"\",10^(-$P$16*($AT41^0.5/(1+$AT41^0.5)-$P$17*$AT41)))","v":0.89870403891190154},null,{"$f":"IF(C41=\"\",\"\",C41-B41)","v":7.864429846450971E-3}]
[0.86452067247591913,3.0144833158234077,3.0212397575378418,1.0839904962594142E-3,{"$f":"IF(A42=\"\",\"\",IF(A43=\"\",(B42-B41)/(A42-A41),((B43-B42)/(A43-A42)+(B42-B41)/(A42-A41))/2))","v":0.17380245620874141},{"$f":"IF(A42=\"\",\"\",IF(C42=\"\",\"0,00001\",(IF(ABS(C42-B42)<0.00001,0.00001,C42-B42))))","v":6.7564417144341249E-3},{"$f":"IF(A42=\"\",\"\",IF(AX42=\"X\",0,IF(ABS(E42)<0.00001,(0.00001^M$20)*(ABS(H42)^I$20)*ABS(F42)^K$20,((ABS(E42))^M$20)*((ABS(H42))^I$20)*ABS(F42)^K$20)))","v":4.0041753934123452E-8},{"$f":"IF(A42=\"\",\"\",I42-J42)","v":-2.0010435760903222E-4},{"$f":"IF(A42=\"\",\"\",L42*I$18+K42*E$19)","v":0.10544365655455583},{"$f":"IF(A42=\"\",\"\",D42 -$AC$9/AU42^2/D42+L42*(W42*$B$11+X42*$C$11+Y42*$D$11+Z42*$E$11+AA42*$F$11+AB42*$G$11+AC42*$H$11)+K42*(AD42*$B$18+AE42*$C$18+AF42*$D$18))","v":0.10564376091216486},{"$f":"IF(A42=\"\",\"\",A42/(A42+$G$16))","v":4.1434964456977842E-2},{"$f":"IF(A42=\"\",\"\",$E$16/(A42+$G$16))","v":0.95856503554302219},117821.91684730387,6432289.8733149311,5026180248.0052986,50.318276798158699,1901190.7955711607,28459148770.178322,1.0000000000862994,{"$f":"IF($A42=\"\",\"\",(1+(AC$5*$AU42^(-2*AC$4))*$D42+(AC$6*$AU42^(-4*AC$4-2))*$D42^2))","v":1.0000000008629943},85705342293.331467,28459148770.178322,2.5190012897286476,1.1952843384371388,1.9157146187080769,0.98012650544430824,0.99999947401386424,1.9994850459641011,8.629961081498595E-11,{"$f":"IF($A42=\"\",\"\",((AC$5*$AU42^(-2*AC$4))*$D42+2*(AC$6*$AU42^(-4*AC$4-2))*$D42^2)/T42)","v":8.6299441979007229E-10},0.99999999998833211,1.9994850459641011,6.0398509974289366E-3,3.2725408726051808E-3,"","","","","",{"$f":"IF(B$18=0,\"\",IF($A42=\"\",\"\",0.5*B$18*$K42*(1*AC$4^2+(AC$5*$AU42^(-2*AC$4))*$D42*(AC$4+1)^2+(AC$6*$AU42^(-4*AC$4-2))*$D42^2*(AC$4+2)^2)/T42))","v":""},2.4172918133366934E-14,"",{"$f":"IF(A42=\"\",\"\",SUM(AG42:AP42)+0.5*(D42+ $AC$9/AU42^2/D42)+$L42*$S$16+$K42*$T$16)","v":1.2074122496118854E-2},{"$f":"IF(A42=\"\",\"\",AQ42+$L42*S$14+$K42*$T$14)","v":1.2074122496118854E-2},null,1.2638044869374632E-2,{"$f":"IF(A42=\"\",\"\",10^(-$P$16*($AT42^0.5/(1+$AT42^0.5)-$P$17*$AT42)))","v":0.89225955944738278},null,{"$f":"IF(C42=\"\",\"\",C42-B42)","v":6.7564417144341249E-3}]
[1.6730848595034331,3.1661665179659297,3.158301830291748,7.6922944409740747E-4,{"$f":"IF(A43=\"\",\"\",IF(A44=\"\",(B43-B42)/(A43-A42),((B44-B43)/(A44-A43)+(B43-B42)/(A43-A42))/2))","v":0.18233743028337551},{"$f":"IF(A43=\"\",\"\",IF(C43=\"\",\"0,00001\",(IF(ABS(C43-B43)<0.00001,0.00001,C43-B43))))","v":-7.8646876741816918E-3},4.2425109981127312E-8,2.0597356621937513E-4,0.10150983887276614,0.10130386530654677,7.7196433749476226E-2,0.92280356625052373,47177.117388434286,4252224.8990861308,2525628670.9811249,35.562970806813382,1349137.5234450197,13806908854.048151,1.0000000000604798,1.0000000006047991,60063559313.120911,13806908854.048151,2.4195399879327133,1.1469095548116821,1.883909486171087,0.97188086435657361,0.9999992587857186,1.9992653679741068,6.0479993194291126E-11,6.0479909283338838E-10,0.99999999998335098,1.9992653679741068,7.1509365461879699E-3,2.3700422425403096E-3,"","","","","","",6.4262287010863707E-14,"",1.3907881160048378E-2,1.3907881160048378E-2,null,1.432573566887882E-2,0.88670178449923887,null,-7.8646876741816918E-3]
[2.4170489597599953,3.2979070218436259,3.2950539588928223,5.7167302539701248E-4,0.18999172653963853,-2.8530629508036753E-3,4.3417373257125866E-9,6.5891860845726513E-5,9.8140988847960089E-2,9.8075096987114363E-2,0.10782190662556652,0.89217809337443343,21737.882208498981,3001514.4239879479,1397968481.3287654,26.3535195374252,1002647.1726727099,7335033588.756012,1.0000000000443647,1.0000000004436478,44059367264.851089,7335033588.756012,2.3312002499697213,1.1134603832808263,1.8481441819237328,0.96205440421041755,0.9999990026401836,1.9989987862093335,4.4364822985982476E-11,4.4364777260290392E-10,0.99999999997730338,1.9989987862093335,8.142655978480743E-3,1.7696759204776024E-3,"","","","","","",1.2235979919709695E-13,"",1.5727001455962529E-2,1.5727001455962529E-2,null,1.6240941088987375E-2,0.88093786563047716,null,-2.8530629508036753E-3]
[3.093775681918487,3.4352178099981634,3.4315009117126465,4.1931096188584858E-4,0.19283068632121847,-3.7168982855169119E-3,5.6732407337761712E-9,7.5320918301466366E-5,9.5265121748217149E-2,9.5189800829915683E-2,0.13396578041332544,0.86603421958667459,10028.263981019838,2108603.3301166352,766424167.5269289,19.36657446130878,735422.32026010356,3803195903.3528881,1.0000000000321387,1.0000000003213869,31917448321.149578,3803195903.3528881,2.2402415942484466,1.085815767677861,1.8018240601722149,0.94836464228623218,0.99999864023708218,1.9986184341797799,3.2138716475814322E-11,3.2138692187391346E-10,0.99999999996866917,1.9986184341797799,9.244167763644907E-3,1.2992787455393629E-3,"","","","","","",2.0986292366698249E-13,"",1.7585092388275353E-2,1.7585092388275353E-2,null,1.8221287294774034E-2,0.87547948517040597,null,-3.7168982855169119E-3]
[3.7079151172656566,3.5474561115255208,3.5678458213806152,3.2561127231103446E-4,0.2436059604292925,2.0389709855094473E-2,1.3547682923875308E-7,-3.6807177185808893E-4,9.2797335450293311E-2,9.31654072221514E-2,0.15639988159757287,0.8436001184024271,5425.7789279430881,1588349.078276861,473846405.29677391,15.105495465662827,571084.26168621134,2219459593.5489311,1.0000000000246825,1.0000000002468246,24512541711.149471,2219459593.5489311,2.1672585797400226,1.0679419171233564,1.7565332394610529,0.93379892753116522,0.99999824894491574,1.9982018321239052,2.468247061552631E-11,2.4682456133285052E-10,0.99999999995920452,1.9982018321239052,1.0163310723536196E-2,1.0020234087205096E-3,"","","","","","",3.1902012333228333E-13,"",1.9278371640650903E-2,1.9278371640650903E-2,null,2.0118085131644786E-2,0.87065170971686889,null,2.0389709855094473E-2]
[4.2710601899307221,3.7189083810363068,3.704613208770752,2.2037694966895642E-4,0.27495945830856233,-1.4295172265554879E-2,5.2610435170689503E-8,2.293696474485879E-4,9.0644221337999181E-2,9.0414851690550593E-2,0.17597336731514707,0.82402663268485288,2274.3566530161788,1042154.6357717218,236626294.18964079,10.462743549653997,386515.83507974574,990945262.29871035,1.0000000000165583,1.0000000001655835,16444363583.83156,990945262.29871035,2.060033709196428,1.0470156245609743,1.675805992954877,0.9044227744611909,0.99999741278387777,1.997321950284896,1.6558357766762246E-11,1.6558351192740337E-10,0.99999999993918887,1.997321950284896,1.181454380376845E-2,6.7732417136408111E-4,"","","","","","",5.3505678835807226E-13,"",2.1527940677374603E-2,2.1527940677374603E-2,null,2.1730098634273366E-2,0.86681307072229574,null,-1.4295172265554879E-2]
[4.7997453960124403,3.8486815820750819,3.8404688835144043,1.6448519148989197E-4,0.25140250791515384,-8.2126985606776337E-3,1.500349483362751E-8,1.2248875390674652E-4,8.8711852353037662E-2,8.8589363599130916E-2,0.19354010774579133,0.80645989225420867,1184.6413380814222,758954.07511078031,141616702.41256401,7.9744510589748527,288488.37019582989,532087015.58885103,1.0000000000122042,1.0000000001220422,12120206831.358484,532087015.58885103,1.9779661114162959,1.0355144608868725,1.6057435605120209,0.87459951881270259,0.99999653365576113,1.9963699630470635,1.2204224106535481E-11,1.2204220490515139E-10,0.99999999991749311,1.9963699630470635,1.3197576884907691E-2,5.0074383737076648E-4,"","","","","","",7.9841916247273542E-13,"",2.3582072457568961E-2,2.3582072457568961E-2,null,2.4182727242032777E-2,0.86137371128662465,null,-8.2126985606776337E-3]
[5.3122257080394775,3.9805637710305835,3.9767165184020996,1.2211196194388105E-4,0.24391032915420702,-3.8472526284838438E-3,3.0286727550453498E-9,5.503337855379542E-5,8.6915760681812504E-2,8.6860727303258708E-2,0.20986798116106592,0.79013201883893414,629.78117400546409,551859.04029709392,86166537.738021612,6.1181646030981494,214170.78909501611,283618992.94878161,1.0000000000089559,1.0000000000895601,8894350689.939703,283618992.94878161,1.8931779269928055,1.0266081525300164,1.5299634094420431,0.83655228898326561,0.99999533082917502,1.9950599016158945,8.9560055703037235E-12,8.9560036004921525E-11,0.99999999988756905,1.9950599016158945,1.4784092651646893E-2,3.6759442854705267E-4,"","","","","","",1.1797824736011656E-12,"",2.5828125034388645E-2,2.5828125034388645E-2,null,2.6609243071170192E-2,0.85640268448187951,null,-3.8472526284838438E-3]
[5.8246104617137462,4.0986580410004088,4.1137270927429199,9.3528450906130836E-5,0.25467207202881786,1.5069051742511164E-2,4.4966329169811262E-8,-2.1205265659691996E-4,8.5191269592454669E-2,8.5403322249051589E-2,0.22554494947170714,0.77445505052829289,365.88898781255756,415662.4237444718,56334755.001149446,4.8791821858928994,164038.72641172726,161477592.32325476,1.0000000000067879,1.0000000000678797,6741246018.5145102,161477592.32325476,1.814310972223772,1.0205065312639956,1.4607871530646261,0.79504762029766307,0.99999390387854215,1.9934923352233915,6.7879753724932769E-12,6.7879742290694204E-11,0.99999999985165944,1.9934923352233915,1.6343214896325606E-2,2.7770627938010001E-4,"","","","","","",1.6728728550497839E-12,"",2.8064495448853879E-2,2.8064495448853879E-2,null,2.8961209133532888E-2,0.85191883029500592,null,1.5069051742511164E-2]
[6.3471118651796132,4.2443651190220102,4.2494730949401855,6.7325083343883359E-5,0.2958871073683817,5.1079759181753559E-3,5.1576633922460974E-9,-7.1816874007757381E-5,8.3501803280060696E-2,8.3573620154068454E-2,0.2409035152565609,0.75909648474343916,192.87543216969897,293488.62905209488,34197040.287899382,3.7548176843577061,118081.15096170852,80554378.460680962,1.0000000000048206,1.000000000048205,4787324455.9302683,80554378.460680962,1.7118267615047775,1.0148449525034409,1.3776705609973912,0.7336754846537753,0.99999153124785911,1.9908605333279248,4.8205092518885899E-12,4.8205086674138313E-11,0.99999999979111509,1.9908605333279248,1.8566983114837003E-2,1.9709268194220074E-4,"","","","","","",2.5160558624571935E-12,"",3.0960105505007711E-2,3.0960105505007711E-2,null,3.222121781549879E-2,0.84617069638638909,null,5.1079759181753559E-3]
[6.8815902795176953,4.41160862212549,4.3869805335998535,4.6040200267518213E-5,0.25826347530472171,-2.4628088525636471E-2,1.1892459728640101E-7,3.4485445812168503E-4,8.1841562537328202E-2,8.1496708079206517E-2,0.25599639783071509,0.74400360216928496,98.612268454955441,197743.01894972561,20119805.296309099,2.8648570712755159,80750.009550090021,36700925.600074545,1.0000000000032632,1.0000000000326321,3240750164.9617314,36700925.600074545,1.5901590852753735,1.0101968554583527,1.291189427908938,0.65094244664891021,0.99998761610053577,1.9865575434140834,3.2632142714264172E-12,3.263214000871055E-11,0.9999999996914295,1.9865575434140834,2.1369546094797503E-2,1.3276000153375554E-4,"","","","","","",3.9496472236349951E-12,"",3.4440007360210655E-2,3.4440007360210655E-2,null,3.4843410896316943E-2,0.84188771800550888,null,-2.4628088525636471E-2]
[7.4217404995579273,4.521592501787568,4.5243868827819824,3.5918708864235665E-5,0.2082217002601941,2.7943809944144249E-3,1.4723206926974785E-9,-3.8370831274517347E-5,8.0229457061613149E-2,8.0267827892887667E-2,0.27065169330435374,0.72934830669564632,64.472690656403884,152396.64655950665,14366745.368712444,2.4404370361800334,62998.123128313753,21764887.860120773,1.0000000000025207,1.0000000000252054,2503192676.234961,21764887.860120773,1.5063791180204165,1.0079704380615568,1.2408815853612061,0.59023732832489706,0.99998412651123014,1.9826654045814116,2.5205441590088657E-12,2.5205439959753505E-11,0.99999999960051023,1.9826654045814116,2.3198258286696354E-2,1.0179514257994303E-4,"","","","","","",5.4061298571598476E-12,"",3.6963196144116563E-2,3.6963196144116563E-2,null,3.7581819912590887E-2,0.83769665469240473,null,2.7943809944144249E-3]
[7.9563823051284999,4.6353782816720388,4.6610407829284668,2.7783087630225153E-5,0.27531248922897822,2.5662501256427994E-2,1.1548076564025686E-7,-3.398246101156549E-4,7.8695137587970143E-2,7.9034962198085798E-2,0.28459985338192095,0.71540014661807905,42.533620438380183,116455.3758704794,10270426.96201168,2.1027141003980492,48729.215675612912,12691184.376362631,1.0000000000019296,1.0000000000192959,1916297478.5453563,12691184.376362631,1.4192630390390606,1.0061727709950072,1.1954427479532619,0.5244241716880591,0.99997947843021617,1.9774759629965493,1.9295807243033685E-12,1.9295806277659516E-11,0.99999999947816032,1.9774759629965493,2.513359898223318E-2,7.7416084357465097E-5,"","","","","","",7.4257743531019538E-12,"",3.9565344588240917E-2,3.9565344588240917E-2,null,4.0596537664648796E-2,0.83337642281851221,null,2.5662501256427994E-2]
[8.474586644442752,4.8104270783186243,4.7949357032775879,1.8690002918336134E-5,0.2912102914811755,-1.549137504103637E-2,3.7336461213391352E-8,1.932264506049608E-4,7.7262977666204352E-2,7.7069751215599391E-2,0.29761930349555032,0.70238069650444968,23.689487092204484,77153.471931451713,6286290.9630874814,1.7320428011473123,32781.031697835351,5582375.8905160353,1.000000000001281,1.0000000000128095,1272144587.5138161,5582375.8905160353,1.2889086850027212,1.0041537209417641,1.138868926159698,0.42264706199084923,0.9999694945537646,1.9664533512920988,1.2809627194018522E-12,1.2809626762909724E-11,0.99999999921392579,1.9664533512920988,2.8342584689124501E-2,5.1322425927705514E-5,"","","","","","",1.1697542339789974E-11,"",4.3392652669850464E-2,4.3392652669850464E-2,null,4.4743319230675982E-2,0.82787268282928961,null,-1.549137504103637E-2]
[8.9702512661460787,4.9316774488408512,4.9331765174865723,1.4178821509969694E-5,0.26278911996743148,1.4990686457210245E-3,3.0967366290656274E-10,-1.7597547070730135E-5,7.5941051796636766E-2,7.5958649343707496E-2,0.30963664014293496,0.6903633598570651,16.454226493222063,58128.459157447782,4552140.2598023657,1.5520837532490557,24868.958585430402,3190928.1110105165,1.0000000000009661,1.0000000000096607,959411604.93527663,3190928.1110105165,1.2034361394518724,1.0031469410964728,1.1084321952638183,0.35570487230044812,0.99995978922894724,1.9559993629044161,9.6606195486149247E-13,9.6606193019652269E-12,0.99999999895769454,1.9559993629044161,3.0352998759393564E-2,3.8395847105482766E-5,"","","","","","",1.6136798770733212E-11,"",4.5986896184761046E-2,4.5986896184761046E-2,null,4.6698681182647264E-2,0.8254341178983996,null,1.4990686457210245E-3]
[9.4442562817130238,5.0648522118982555,5.0656495094299316,1.0501604748308151E-5,0.27964563596010328,7.9729753167612216E-4,7.8528234179627053E-11,-8.8616157770254889E-6,7.4718523399429748E-2,7.4727385015206774E-2,0.32075037628233721,0.67924962371766273,{"$f":"IF($A57=\"\",\"\",(1+(V$5*$AU57^(-2*V$4))*$D57+(V$6*$AU57^(-4*V$4-2))*$D57^2+(V$7*$AU57^(-6*V$4-6))*$D57^3+(V$8*$AU57^(-8*V$4-12))*$D57^4+(V$9*$AU57^(-10*V$4-20))*$D57^5+(V$10*$AU57^(-12*V$4-30))*$D57^6))","v":11.154973575826729},42468.797977558075,3190241.5039650821,1.4036824859089654,18419.559806106517,1711492.6307362777,1.0000000000007063,1.0000000000070639,701519759.56420958,1711492.6307362777,{"$f":"IF($A57=\"\",\"\",((V$5*$AU57^(-2*V$4))*$D57+2*(V$6*$AU57^(-4*V$4-2))*$D57^2+3*(V$7*$AU57^(-6*V$4-6))*$D57^3+4*(V$8*$AU57^(-8*V$4-12))*$D57^4+5*(V$9*$AU57^(-10*V$4-20))*$D57^5+6*(V$10*$AU57^(-12*V$4-30))*$D57^6)/M57)","v":1.1094787254182015},1.0023219002120043,1.081665537816449,0.28758817607356385,0.99994570988609244,1.9407814617329826,7.0638247605971982E-13,7.0638246270221249E-12,0.99999999857452337,1.9407814617329826,{"$f":"IF(B$11=0,\"\",IF($A57=\"\",\"\",0.5*B$11*$L57*(1*V$4^2+(V$5*$AU57^(-2*V$4))*$D57*(V$4+1)^2+(V$6*$AU57^(-4*V$4-2))*$D57^2*(V$4+2)^2+(V$7*$AU57^(-6*V$4-6))*$D57^3*(V$4+3)^2+(V$8*$AU57^(-8*V$4-12))*$D57^4*(V$4+4)^2+(V$9*$AU57^(-10*V$4-20))*$D57^5*(V$4+5)^2+(V$10*$AU57^(-12*V$4-30))*$D57^6*(V$4+6)^2)/M57))","v":3.2722178464986304E-2},2.8131227646740457E-5,"","","","","","",2.2861107752801593E-11,"",4.8897943823480589E-2,4.8897943823480589E-2,null,5.1207703673353235E-2,0.82014779100701973,null,7.9729753167612216E-4]
[9.9037849402520806,5.1927550425346434,5.2046332359313965,7.8387089870707024E-6,0.3166121095425013,1.1878193396753112E-2,1.6142546382219298E-8,-1.2705332102003197E-4,7.3570330858105604E-2,7.3697384179125636E-2,0.33118834154405186,0.66881165845594814,8.0629590536375204,31551.542786231908,2312315.334822461,1.3000857504099237,13749.158852035085,961150.98618722009,1.0000000000005251,1.0000000000052511,521489266.75824475,961150.98618722009,1.0256273053073168,1.0017200444897696,1.0620071100001782,0.23081996731008328,0.99992726827795342,1.9219332381508976,5.2510406489039453E-13,5.2510405747872023E-12,0.99999999808241502,1.9219332381508976,3.4883139238804338E-2,2.0852396867820436E-5,"","","","","","",3.1754089935813217E-11,"",5.1570581324295331E-2,5.1570581324295331E-2,null,5.272494644211026E-2,0.81846557202685,null,1.1878193396753112E-2]
[10.359476463636383,5.3544751292944293,5.3388123512268066,5.4281909602629675E-6,0.30666675385421438,-1.5662778067622618E-2,2.7301605979470249E-8,1.6523197626207298E-4,7.2466050414245739E-2,7.2300818437983666E-2,0.34122711160861535,0.65877288839138459,5.4893121669160339,21624.304650733113,1539530.2018550585,1.2057759540721089,9521.3982854789228,463549.3742644887,1.0000000000003602,1.0000000000036007,357597624.52320516,463549.3742644887,0.91775168976108223,1.0011674452257207,1.0433644693298159,0.1706585318584011,0.99989497340936517,1.8900854517689516,3.6007637574070408E-13,3.6007637222127534E-12,0.99999999720356081,1.8900854517689516,3.7972309767945342E-2,1.4510381010772166E-5,"","","","","","",4.7711042832510838E-11,"",5.5152593656353624E-2,5.5152593656353624E-2,null,5.650982364254245E-2,0.81445998739649184,null,-1.5662778067622618E-2]
[10.821387543110177,5.4738533306910524,5.4756655693054199,4.1376611880293561E-6,0.27766152790266763,1.8122386143675229E-3,3.6727166295476273E-10,-1.9164333094442987E-5,7.1380023007944576E-2,7.1399187341039019E-2,0.35109994733281219,0.64890005266718775,4.2513425201928294,16366.923499366048,1145452.0340369418,1.1557895823351236,7257.963280912104,273199.58048810606,1.0000000000002727,1.000000000002726,270731266.2924974,273199.58048810606,0.83706866061550678,1.0008642943246404,1.0331796636108006,0.13479060956785127,0.999862220300476,1.8597623764089597,2.7260788702719926E-13,2.7260788499618287E-12,0.99999999630630032,1.8597623764089597,4.0223144918457174E-2,1.11909451305313E-5,"","","","","","",6.4842888695664109E-11,"",5.789158209576864E-2,5.789158209576864E-2,null,5.9274461008089384E-2,0.81169289353108431,null,1.8122386143675229E-3]
[11.294792395783588,5.6143972606403301,5.6117568016052246,3.0052028307381383E-6,0.2837691018059697,-2.640459035105458E-3,7.9261440365560682E-10,2.8153408384343215E-5,7.0300237948227956E-2,7.0272084539843613E-2,0.36091603526040195,0.63908396473959805,3.2457906425301966,11793.985820240459,811712.38405572902,1.1122875715620371,5271.7666489112862,148497.08705289735,1.0000000000001965,1.0000000000019649,195133435.91876316,148497.08705289735,0.73988224306354267,1.0005874827964727,1.0241377587269846,0.10095192505329027,0.99981031026853084,1.8154545459973244,1.9648603645246485E-13,1.9648603538924454E-12,0.99999999487530167,1.8154545459973244,4.3105322495274316E-2,8.4583186424740069E-6,"","","","","","",9.247929078916452E-11,"",6.1259750455396576E-2,6.1259750455396576E-2,null,6.252967624085401E-2,0.80859108748494679,null,-2.640459035105458E-3]
[11.77711617317982,5.7449426599732014,5.7483677864074707,2.2327124893169954E-6,0.27076117137235189,3.4251264342692878E-3,1.3209858835876536E-9,-3.6345369493068214E-5,6.9233197247169587E-2,6.9269542616662655E-2,0.37061626703306122,0.62938373296693884,2.6039256164367877,8700.5923506792642,590998.59608841606,1.0828479713019417,3916.910901231659,85545.037523234598,1.000000000000145,1.0000000000014497,143973274.18871918,85545.037523234598,0.647804224090061,1.0003846002235908,1.0179219550291176,7.6509328638563232E-2,0.99974469677120159,1.7652641667213043,1.4497124888931386E-13,1.4497124830649899E-12,0.99999999305426646,1.7652641667213043,4.5817651097217499E-2,6.7610060775094709E-6,"","","","","","",1.2871009189777124E-10,"",6.4453510420923107E-2,6.4453510420923107E-2,null,6.5614760384155563E-2,0.80579494443060962,null,3.4251264342692878E-3]
[12.257455390645191,5.8750488185276026,5.8846573829650879,1.6602982314797311E-6,0.30684585509493795,9.6085644374852563E-3,9.7908878282156142E-9,-9.8948915245269942E-5,6.8202259766652271E-2,6.8301208681897541E-2,0.379988292387127,0.62001170761287294,2.1528271845362981,6426.0668772241434,431581.62879052217,1.061195044882083,2912.964695434659,50210.77004540756,1.000000000000107,1.0000000000010709,106344800.71143939,50210.77004540756,0.55606579272306789,1.0002158823659462,1.013299155349531,5.7666161538553813E-2,0.9996567071336061,1.7065673163859449,1.070819470027161E-13,1.0708194668259318E-12,0.99999999059662537,1.7065673163859449,4.8514592881971838E-2,5.7134763512534643E-6,"","","","","","",1.7865861323028091E-10,"",6.7616274072861526E-2,6.7616274072861526E-2,null,6.874229928000225E-2,0.80309158664653635,null,9.6085644374852563E-3]
[12.71934456541203,6.0333976528943056,6.0199007987976074,1.1569831843171131E-6,0.29237759252746237,-1.3496854096698208E-2,1.6746401519637096E-8,1.294078881662053E-4,6.7239468919241679E-2,6.7110061031075474E-2,0.38874081172328206,0.61125918827671799,1.7775374822382048,4447.2115453070855,295435.62444031669,1.0423523630968978,2030.210247932577,27004.18807008661,1.0000000000000742,1.0000000000007412,73599972.689283758,27004.18807008661,0.44910420025507469,1.0000340309691156,1.0092402553621664,4.0631522118937023E-2,0.9995074401771844,1.6249554185988242,7.4110142492019185E-14,7.4110142337629753E-13,0.99999998641303844,1.6249554185988242,5.1779255817137715E-2,5.1694298074372624E-6,"","","","","","",2.6409032335135854E-10,"",7.1316418150792468E-2,7.1316418150792468E-2,null,7.2079689705347116E-2,0.80034143234234645,null,-1.3496854096698208E-2]
[13.145653632236645,6.1365331355558066,6.1561675071716309,9.145988562074879E-7,0.32351558094142219,1.9634371615824264E-2,2.93251505309923E-8,-1.7124587741312869E-4,6.6374655825893414E-2,6.6545901703306543E-2,0.39660263689751185,0.60339736310248815,1.6023749170661605,3498.7759639973528,230862.56034031464,1.0333198528653009,1605.0971009090895,18325.510847839054,1.0000000000000584,1.0000000000005831,57903268.92312739,18325.510847839054,0.38382835850812896,0.99991883851261554,1.0072822706619771,3.224543956346921E-2,0.99937698473230463,1.5672580987102471,5.8304634308455166E-14,5.8304634212438717E-13,0.99999998272981783,1.5672580987102471,5.3517515032343116E-2,5.1737874911323988E-6,"","","","","","",3.4246998854593437E-10,"",7.3446439926856649E-2,7.3446439926856649E-2,null,7.4498853407570759E-2,0.79842883051018032,null,1.9634371615824264E-2]
[13.523212500149384,6.289483973415499,6.287696361541748,6.4568305928292867E-7,0.4328057640600631,-1.7876118737509827E-3,1.7918800069602346E-10,1.3386112232310898E-5,6.5627103964280786E-2,6.5613717852048475E-2,0.40339846606553958,0.59660153393446036,1.4124993792545042,2450.4886648217534,160042.54670477365,1.0233352609145845,1133.4509280458665,10567.615337211893,1.0000000000000409,1.0000000000004083,40552036.756448045,10567.615337211893,0.29632543830551766,0.99973638868834658,1.0051080156049483,2.2803143608800463E-2,0.99911773860230191,1.4785813069975717,4.0833129092307088E-14,4.0833129044834532E-13,0.99999997534032614,1.4785813069975717,5.6123081521238502E-2,5.7630614323131945E-6,"","","","","","",4.9738373005567532E-10,"",7.6391207335098132E-2,7.6391207335098132E-2,null,7.8727227702787325E-2,0.79523710306119355,null,-1.7876118737509827E-3]
[13.845238737994805,6.4377792838261589,6.4250950813293457,4.5919885892884291E-7,0.44724015515002091,-1.2684202496813235E-2,6.2417272295068622E-9,7.9004602584323291E-5,6.5002683804213118E-2,6.4923679201628795E-2,0.40907493208053758,0.59092506791946242,1.2909956062628278,1740.7437144920841,113361.90137620781,1.0165745074860006,806.379925143283,6457.0473004069136,1.0000000000000291,1.00000000000029,28803193.845284835,6457.0473004069136,0.22776240714414681,0.99952826509817871,1.0036291056486504,1.6304272204296803E-2,0.99875988976310104,1.3945633093224745,2.9002847066598258E-14,2.9002847042618125E-13,0.99999996528162793,1.3945633093224745,5.8092335269644454E-2,6.9959115071186047E-6,"","","","","","",7.1012078430931422E-10,"",7.8644552847489682E-2,7.8644552847489682E-2,null,7.9421345939543725E-2,0.79473056472369208,null,-1.2684202496813235E-2]
[14.111269650748,6.5532296214033243,6.5592150688171387,3.5256419781312416E-7,0.52056735920550534,5.9854474138143487E-3,9.4810792970502618E-10,-3.0791361283727392E-5,6.4495733359949514E-2,6.4526524721233242E-2,0.41368350680662996,0.58631649319337009,1.2207592455297833,1332.4866792335624,86413.949291473764,1.0126853527583082,619.35547219192006,4470.2616077841685,1.0000000000000222,1.000000000000222,22044617.53636634,4470.2616077841685,0.18228452144994911,0.99932838728745244,1.0027750980622945,1.2526450317224855E-2,0.9983854183180767,1.3326937024239369,2.2197422533812932E-14,2.2197422519721657E-13,0.99999995463745295,1.3326937024239369,5.9292161606221389E-2,8.5008100339031957E-6,"","","","","","",9.3828687688545472E-10,"",8.0075553536212485E-2,8.0075553536212485E-2,null,8.1173063055511432E-2,0.79347303068345876,null,5.9854474138143487E-3]
[14.325537603581324,6.6833248358587722,6.6930451393127441,2.6160867938685974E-7,0.78050455473071079,9.7203034539719013E-3,1.6053651193856027E-9,-4.0067007866642634E-5,6.4093136060145578E-2,6.4133203068012221E-2,0.41734343010221875,0.58265656989778125,1.1623186974594781,986.65201557324679,63774.713957331238,1.0093907046106581,459.83036188918589,3016.2882971320614,1.0000000000000164,1.0000000000001643,16319175.254942,3016.2882971320614,0.14047756758646551,0.9990449755389591,1.0020487199048824,9.3033396956831767E-3,0.99782528496837064,1.2694234907070439,1.6432293375409498E-14,1.6432293367669165E-13,0.99999993872239346,1.2694234907070439,6.0435201857810435E-2,1.0919834497656883E-5,"","","","","","",1.2786903246713801E-9,"",8.1403406743443207E-2,8.1403406743443207E-2,null,8.2494863348362604E-2,0.79254333062658333,null,9.7203034539719013E-3]
[14.494941515149549,6.8449103813436096,6.8264470100402832,1.8048549036373275E-7,0.9692769402880036,-1.8463371303326426E-2,3.4174062379894563E-9,5.845858566531914E-5,6.3778376055450545E-2,6.3719917469785226E-2,0.42020484391265411,0.57979515608734589,1.111198879310392,679.81978395827582,43818.733704463928,1.0064675075382241,317.5499824142999,1899.9443254483217,1.0000000000000113,1.0000000000001132,11239240.959868671,1899.9443254483217,0.10047912218793519,0.99856936652305861,1.001399863584524,6.4259476732073809E-3,0.99685088944928579,1.2022548563508562,1.1317146653501449E-14,1.131714664982365E-13,0.99999991102602004,1.2022548563508562,6.1581525234965864E-2,1.5318885577928329E-5,"","","","","","",1.8693648682017588E-9,"",8.2696731967183953E-2,8.2696731967183953E-2,null,8.34841248762552E-2,0.79185802962419893,null,-1.8463371303326426E-2]
[14.627351105445996,6.9752949122829682,6.9593911170959473,1.3375816342626251E-7,1.2442147590240602,-1.5903795187020897E-2,1.5562276649675854E-9,3.9449051509099498E-5,6.3534497492012107E-2,6.3495048440503007E-2,0.42242189016720622,0.57757810983279378,1.0820240767476397,503.46160704333244,32384.011018915211,1.0047872915634817,235.59583479548556,1330.9139040599498,1.0000000000000084,1.0000000000000837,8319360.2464833315,1330.9139040599498,7.6034891254388129E-2,0.99804363557573961,1.0010225821394307,4.7644825961447755E-3,0.99575544278671957,1.1576647580083008,8.3770262920800466E-15,8.3770262900625238E-14,0.99999987979844962,1.1576647580083008,6.2225714372876578E-2,2.0357541070886095E-5,"","","","","","",2.5387883061426974E-9,"",8.3456462704171452E-2,8.3456462704171452E-2,null,8.4182575920084421E-2,0.79137949021752274,null,-1.5903795187020897E-2]
[14.730495709227398,7.1303958686867892,7.0919795036315918,9.3618293791909091E-8,1.645762087483424,-3.841636505519741E-2,5.3568103487454048E-9,7.3190233971107133E-5,6.3345809123578511E-2,6.3272618889607404E-2,0.42413721452624459,0.57586278547375547,1.0572451719980021,352.44441243779659,22629.439075757778,1.003348478701207,165.19530009732293,886.31158339715898,1.0000000000000058,1.0000000000000586,5818990.0620073574,886.31158339715898,5.4259898439557162E-2,0.99718357175565009,1.0006928787172784,3.3373038104782637E-3,0.9939465590158385,1.1151759492857967,5.8593243683344929E-15,5.8593243673468121E-14,0.999999828148873,1.1151759492857967,6.2822847753023339E-2,2.877470570306699E-5,"","","","","","",3.6444229153738356E-9,"",8.4147521499304989E-2,8.4147521499304989E-2,null,8.4561175480861242E-2,0.79112190478283428,null,-3.841636505519741E-2]
[14.811393191339448,7.2750244482415463,7.2235817909240723,6.7129484260105263E-8,1.4640668132668784,-5.1442657317473994E-2,5.9481555781932275E-9,7.7124286565213862E-5,6.3198601097968002E-2,6.3121476811402788E-2,0.42547545023346839,0.57452454976653156,1.0409207772496221,252.79338689841657,16196.402108471602,1.0023990416778286,118.737093542492,613.8356702324046,1.0000000000000042,1.000000000000042,4169057.6159346667,613.8356702324046,3.9371535943841858E-2,0.99605916906120939,1.0004664373639249,2.3933000512579815E-3,0.99157803201876304,1.0844996102195255,4.1979551363843343E-15,4.1979551358769232E-14,0.99999976013763969,1.0844996102195255,6.3210586137440294E-2,3.9882147993345079E-5,"","","","","","",5.1027772872129106E-9,"",8.4613094721394139E-2,8.4613094721394139E-2,null,8.5048866693035061E-2,0.79079195264374569,null,-5.1442657317473994E-2]
[14.876167824259028,7.3488890914355176,7.355135440826416,5.6641443604344121E-8,1.1880158809040813,6.2463493908984091E-3,6.3792068000924114E-11,-7.9869936772808403E-6,6.3081223919151233E-2,6.3089210912828514E-2,0.42654250028902319,0.57345749971097681,1.034478467862443,213.36992348519246,13654.193191164275,1.0020234268265651,100.34232353382886,510.7021120515484,1.0000000000000036,1.0000000000000353,3516313.8161183568,510.7021120515484,3.3371820464004234E-2,0.99532592469526204,1.0003722772432451,2.0193408381411113E-3,0.99003411556776577,1.0716559327881148,3.5406867325401212E-15,3.5406867321790197E-14,0.99999971561127576,1.0716559327881148,6.330794434206774E-2,4.7111981286880762E-5,"","","","","","",6.0651938733938372E-9,"",8.4770888502344002E-2,8.4770888502344002E-2,null,8.5280421703166048E-2,0.7906360178956422,null,6.2463493908984091E-3]
[14.930107296677306,7.4155420376162571,7.4866576194763184,4.8596075314995884E-8,2.1498952791161963,7.1115581860061283E-2,6.4148508063111427E-9,-8.0092763757477758E-5,6.2983813169484801E-2,6.3063905933242279E-2,0.42742803993898748,0.57257196006101252,1.0295268203535179,183.10398646277881,11701.225309224112,1.0017350609212927,86.231708961004983,433.22980797459411,1.0000000000000031,1.0000000000000304,3015191.3069529836,433.22980797459411,2.8711336365202015E-2,0.99454944222776642,1.0002965813367231,1.7320556991355515E-3,0.98840333779709488,1.061462966362859,3.0360906079810177E-15,3.0360906077153598E-14,0.99999966834608545,1.061462966362859,6.3376774991861992E-2,5.4775608930627625E-5,"","","","","","",7.0879091312273481E-9,"",8.489154367688545E-2,8.489154367688545E-2,null,8.560548098932777E-2,0.79041789833552289,null,7.1115581860061283E-2]
[14.977849138667807,7.5618274178975549,7.6194272041320801,3.4702584871770746E-8,3.2395877428290056,5.7599786234525219E-2,3.3160201473613459E-9,-5.7584895131981839E-5,6.2897845526237894E-2,6.2955430421369876E-2,0.42820955283124834,0.5717904471687516,1.0210651905909984,131.01298011421508,8351.7090120446665,1.0012387490634926,61.864186970107575,303.88462788987863,1.0000000000000022,1.0000000000000218,2152700.1491500312,303.88462788987863,2.0646702159751718E-2,0.99237487809375591,1.000153044224195,1.237216462758063E-3,0.9838355590047082,1.0430411081438882,2.1676209469399333E-15,2.1676209468044917E-14,0.99999953546712006,1.0430411081438882,6.3578210102777671E-2,7.6375910274186133E-5,"","","","","","",9.945870840402969E-9,"",8.5153596427114786E-2,8.5153596427114786E-2,null,8.5730626798284887E-2,0.7903341664450001,null,5.7599786234525219E-2]
[15.023629300994799,7.7181705094079431,7.7538914680480957,2.4213271951338745E-8,3.5394336158230857,3.5720958640152567E-2,1.1996690048593918E-9,-3.4636238318550006E-5,6.2815630357916458E-2,6.2850266596235008E-2,0.42895695280123564,0.57104304719876442,1.0146874379570159,91.70011871843495,5825.2524758458121,1.00086418256746,43.467185561245032,209.29662085760305,1.0000000000000016,1.0000000000000151,1501778.1819229552,209.29662085760305,1.4482720123192959E-2,0.9891002502434777,1.0000186377761147,8.6343640077445581E-4,0.97699413966908422,1.0279562223556293,1.5121870041104642E-15,1.5121870040445369E-14,0.9999993341227007,1.0279562223556293,6.3714945333568848E-2,1.0892004433809158E-4,"","","","","","",1.4281634863411612E-8,"",8.5360230163182657E-2,8.5360230163182657E-2,null,8.5825262723800699E-2,0.79027093724893083,null,3.5720958640152567E-2]
[15.071557174669579,7.893767858068645,7.890082836151123,1.6162149923527924E-8,3.106684883534955,-3.6850219175219578E-3,1.4985065798921818E-11,3.8710548690146229E-6,6.2729788158734881E-2,6.2725917103865866E-2,0.42973732530915409,0.57026267469084591,1.0097961405874751,61.529449508284728,3886.8528169296906,1.000576720186299,29.346479618718934,138.46055188041433,1.0000000000000011,1.00000000000001,1002225.8177070054,138.46055188041433,9.7046317500937129E-3,0.98375117934876721,0.99986972083709647,5.7638777183590794E-4,0.96592436254731762,1.0148105555815707,1.009171908291027E-15,1.0091719082616594E-14,0.99999900222087446,1.0148105555815707,6.3798081525869826E-2,1.6206245408583009E-4,"","","","","","",2.1439146633258313E-8,"",8.5535575992435553E-2,8.5535575992435553E-2,null,8.5942527160734292E-2,0.79019269569413964,null,-3.6850219175219578E-3]
[15.125899777049199,8.032319015460228,8.027442455291748,1.1748056623794317E-8,2.536265994162314,-4.8765601684799265E-3,3.5722625500685585E-11,5.9768407625337971E-6,6.263274011279428E-2,6.2626763272031746E-2,0.43061956769950882,0.56938043230049118,1.0071182043257529,44.994367693856269,2825.0081540098026,1.0004191755453158,21.604687447005801,100.2960104208062,1.0000000000000007,1.0000000000000073,728444.61004115758,100.2960104208062,7.0697600362492332E-3,0.9777775676462217,0.99973831880078556,4.1899991079963849E-4,0.95371374834961609,1.0060966369198219,7.3349293994040745E-16,7.3349293992489172E-15,0.99999862721202648,1.0060966369198219,6.3793106794496748E-2,2.2125343527878408E-4,"","","","","","",2.9557468183832029E-8,"",8.5633961568943262E-2,8.5633961568943262E-2,null,8.5991820492141643E-2,0.79015984115087989,null,-4.8765601684799265E-3]
[15.191364501370117,8.1974829559799236,8.1650433540344238,8.0322120664844036E-9,2.0089925961446755,-3.2439601945499774E-2,2.5109395534784722E-9,5.0109276122076163E-5,6.2516227578453987E-2,6.2466118302331911E-2,0.4316787574627482,0.5683212425372518,1.0048641261772595,31.074589125472986,1931.1456896930827,1.0002865490162642,15.087540130065113,68.520067381661121,1.0000000000000004,1.0000000000000051,497966.11794140772,68.520067381661121,4.8414547314595165E-3,0.96782110565370494,0.99954526064947835,2.8646692944746754E-4,0.93372014315260787,0.99639437207840775,5.0141684724678063E-16,5.0141684723952873E-15,0.99999799183124316,0.99639437207840775,6.3753557975038136E-2,3.1974765607757448E-4,"","","","","","",4.3344189685767024E-8,"",8.5746032550918339E-2,8.5746032550918339E-2,null,8.6082186196753493E-2,0.79009966530355102,null,-3.2439601945499774E-2]
[15.273365386528894,8.3200775229652173,8.3023514747619629,6.0571071708640489E-9,1.2951556290155821,-1.7726048203254408E-2,1.1826534790282196E-9,3.4389729266573466E-5,6.2370894522136691E-2,6.2336504792870118E-2,0.43299994823748467,0.56700005176251533,1.0036666350149168,23.676722477144097,1456.1735934369892,1.0002160626489038,11.623442164544366,51.765818452883693,1.0000000000000004,1.0000000000000038,375474.85032682517,51.765818452883693,3.6537371020732888E-3,0.95776572323398812,0.99936083075211746,2.1601597591984606E-4,0.91396696556461077,0.98895080981820682,3.7807651072438154E-16,3.7807651072025819E-15,0.9999973367057764,0.98895080981820682,6.3647425862137078E-2,4.1866847320130217E-4,"","","","","","",5.7660313049008187E-8,"",8.5805017708711684E-2,8.5805017708711684E-2,null,8.6149619633002383E-2,0.79005480575753428,null,-1.7726048203254408E-2]
[15.378241875441745,8.4349457734211324,8.4391465187072754,4.6494735688130041E-9,1.0466803421808479,4.2007452861430039E-3,1.0569090850614101E-10,-1.0280608372374711E-5,6.2186000076254792E-2,6.2196280684627167E-2,0.43468078288301676,0.56531921711698319,1.0028141796195607,18.406246199064601,1117.9183427014609,1.0001658458734584,9.154621036169754,39.889371820089195,1.0000000000000002,1.0000000000000029,288208.09634051035,39.889371820089195,2.8065753906705107E-3,0.94567160129988914,0.99914198089445383,1.6581837316537377E-4,0.89076554932759999,0.98125264434893678,2.9020485249578051E-16,2.9020485249335098E-15,0.99999653028484381,0.98125264434893678,6.3488671651241599E-2,5.3694744470162618E-4,"","","","","","",7.5410925022982841E-8,"",8.5848744958084588E-2,8.5848744958084588E-2,null,8.6168158680645993E-2,0.79004247959404605,null,4.2007452861430039E-3]
[15.513370487606153,8.5698161524956955,8.5753264427185059,3.4088158847424896E-9,0.92223417040318734,5.5102902228103545E-3,3.0134680308148943E-10,-1.7359343394307558E-5,6.1949381930159864E-2,6.1966741273554171E-2,0.43683182628413658,0.56316817371586347,1.0020611927333085,13.757467818450204,819.3449074050161,1.0001215525712392,6.9786557146183235,29.444436677853734,1.0000000000000002,1.0000000000000022,211235.15903620291,29.444436677853734,2.057110398007302E-3,0.927312912704224,0.99880625650597943,1.2153779800740882E-4,0.85670592720238647,0.97063696246905107,2.1269836427828068E-16,2.1269836427697516E-15,0.99999526593960697,0.97063696246905107,6.3273470201840556E-2,7.1564759407015421E-4,"","","","","","",1.0339941236043699E-7,"",8.5920123275527421E-2,8.5920123275527421E-2,null,8.6360311594888356E-2,0.78991489386856262,null,5.5102902228103545E-3]
[15.687069651903585,8.7168315396442999,8.7111172676086426,2.4299184837209728E-9,0.7339502073711992,-5.7142720356573307E-3,5.4081353083076719E-10,2.3255397885883766E-5,6.16478565884893E-2,6.1624601190603416E-2,0.43957292669074105,0.56042707330925889,1.0014691831370495,10.093801127158775,584.32020139356814,1.0000866453411692,5.2617866496631107,21.247766385520595,1.0000000000000002,1.0000000000000016,150573.34569114904,21.247766385520595,1.4671078460239272E-3,0.90092978448265526,0.99830766387315728,8.6637834404503192E-5,0.80995048515241008,0.95617463080678766,1.5161606333045585E-16,1.516160633297925E-15,0.99999335871833483,0.95617463080678766,6.2986161454048992E-2,9.7064830662719364E-4,"","","","","","",1.4596638092653472E-7,"",8.6025442762469109E-2,8.6025442762469109E-2,null,8.637003984192046E-2,0.7899084428414469,null,-5.7142720356573307E-3]
[15.908155621727929,8.8542411252590174,8.8465151786804199,1.7709746169141695E-9,0.57836887684338323,-7.7259465785974868E-3,1.5718588711882868E-9,3.9646675411543486E-5,6.1268291670005685E-2,6.1228644994594142E-2,0.4430234676854844,0.5569765323145156,1.0010703081463606,7.6268262684895554,426.01526632951595,1.0000631401214495,4.1060778498624444,15.739281736831584,1,1.0000000000000011,109725.95538210441,15.739281736831584,1.0692063153257194E-3,0.86888420721177129,0.99766654274139277,6.3136135026166965E-5,0.75645858735155225,0.93878593354162554,1.1048553243798317E-16,1.1048553243763086E-15,0.99999088638602851,0.93878593354162554,6.2612205145484115E-2,1.2767021029191973E-3,"","","","","","",2.0187724323872174E-7,"",8.6130826339607988E-2,8.6130826339607988E-2,null,8.6452967589184679E-2,0.7898534840740622,null,-7.7259465785974868E-3]
[16.184989624889567,9.00240730600982,8.9816222190856934,1.259197036528629E-9,0.44407478529146349,-2.0785086924126617E-2,1.7600983236077758E-8,1.3266869727285996E-4,6.079955735155735E-2,6.066688865428449E-2,0.44728462803694841,0.55271537196305154,1.0007605013161727,5.7107690980807222,303.06053781438305,1.0000448840146097,3.2084811303444898,11.467817994345785,1,1.0000000000000009,78000.477786442061,11.467817994345785,7.5994486422829854E-4,0.82489246984703446,0.99671018411897883,4.4882000125411747E-5,0.68832604607132863,0.91440898882539878,7.854014433726892E-17,7.8540144337090839E-16,0.99998717956571059,0.91440898882539878,6.2143870466072851E-2,1.6920099342240197E-3,"","","","","","",2.8671915911949378E-7,"",8.6292137667441482E-2,8.6292137667441482E-2,null,8.6583592651468644E-2,0.78976703283634675,null,-2.0785086924126617E-2]
[16.523913709679618,9.122024757228564,9.1165156364440918,9.5617477867803077E-10,0.33087735325277556,-5.5091207844721879E-3,1.7347650918825965E-9,4.1650511303975568E-5,6.0235367147440329E-2,6.0193716636136353E-2,0.45241355680074419,0.54758644319925587,1.0005769980550623,4.5761299717720876,230.24104469641335,1.0000340732218977,2.6770163006762591,8.9409250507538562,1,1.0000000000000007,59213.473252159936,8.9409250507538562,5.7667768558486454E-4,0.78147490550767085,0.99566419917629922,3.4072060952907559E-5,0.62644979048226823,0.88934412762897097,5.9622914508754079E-17,5.9622914508651426E-16,0.99998311195163736,0.88934412762897097,6.1573476686785082E-2,2.0919440196583922E-3,"","","","","","",3.8201910135734313E-7,"",8.6379461574852642E-2,8.6379461574852642E-2,null,8.6751626988370162E-2,0.78965603488464886,null,-5.5091207844721879E-3]
[16.927168365800753,9.2465585992101644,9.2512259483337402,7.1796364161628388E-10,0.2892604615669232,4.6673491235758036E-3,1.6537745154668726E-9,-4.0666626556266905E-5,5.9577580662845776E-2,5.9618247289402043E-2,0.45839334871604887,0.54160665128395113,1.0004326564000809,3.6839870723407104,172.97316917925471,1.0000255729217578,2.2592224320621064,6.9551830043937191,1,1.0000000000000004,44441.64462418716,6.9551830043937191,4.3247624623558118E-4,0.7285550820453931,0.99422435748403215,2.5572267800161439E-5,0.5573698340595663,0.8570831860365955,4.4748692456346873E-17,4.4748692456289026E-16,0.99997749858250173,0.8570831860365955,6.0905958076521959E-2,2.5701677414312332E-3,"","","","","","",5.1572500589522559E-7,"",8.6491173446888031E-2,8.6491173446888031E-2,null,8.7024893458033853E-2,0.78947603100895425,null,4.6673491235758036E-3]
[17.390738526592031,9.3715830498893755,9.3859257698059082,5.3837377350582317E-10,0.27912211499198947,1.4342719916532687E-2,1.9296199136184528E-8,-1.3891075961272592E-4,5.8838938161099287E-2,5.8977848920712013E-2,0.46510818485769839,0.53489181514230166,1.0003244049423561,3.0125656555589182,129.94899118776291,1.0000191756460535,1.9442432640548355,5.4642009376909941,1,1.0000000000000004,33324.453603476388,5.4642009376909941,3.2430364954915775E-4,0.66805710754003411,0.9923088645791095,1.9175278355091352E-5,0.48566107004817899,0.81760670805181879,3.355444074889018E-17,3.3554440748857653E-16,0.99996999200611358,0.81760670805181879,6.015446200572639E-2,3.1040229708919702E-3,"","","","","","",6.9784817838570447E-7,"",8.6612173231014195E-2,8.6612173231014195E-2,null,8.7041189947835079E-2,0.78946531609527737,null,1.4342719916532687E-2]
[17.902966934489086,9.5193840673700798,9.5204854011535645,3.8313263010456104E-10,0.27407436010331809,1.1013337834846482E-3,1.3113205385019302E-10,-1.145129048842064E-5,5.8043776777857041E-2,5.8055228068345462E-2,0.47233682169082708,0.52766317830917286,1.0002306500837737,2.4318013302258277,92.710194152121773,1.0000136421469807,1.6719688495597413,4.1743105469329427,1,1.0000000000000002,23708.334328993998,4.1743105469329427,2.3059887476247769E-4,0.58878224764452136,0.9892166724860646,1.3641960875071943E-5,0.40190273265957221,0.76084753210179801,2.3871665719939822E-17,2.3871665719923359E-16,0.99995782073990847,0.76084753210179801,5.9344612110059654E-2,3.7933606966536791E-3,"","","","","","",9.9614088264561248E-7,"",8.6858361164558473E-2,8.6858361164558473E-2,null,8.7224608768971035E-2,0.78934487159803179,null,1.1013337834846482E-3]
[18.444899074966088,9.6600715914657815,9.6550049781799316,2.7714534300336133E-10,0.24920768206328292,-5.0666132858498969E-3,2.8903879097869001E-9,5.3762327979607616E-5,5.7225572309970267E-2,5.7171809981990659E-2,0.47977493812636202,0.52022506187363793,1.0001667382420438,2.0354979862916083,67.31195348874337,1.0000098661844798,1.4860798132698423,3.2948773251286831,1,1.0000000000000002,17146.463565555998,3.2948773251286831,1.6671147911034631E-4,0.50871976170594357,0.98514593882786072,9.8660871391442179E-6,0.32708863207038258,0.69676889800289699,1.7264310241312624E-17,1.7264310241304006E-16,0.99994167893594055,0.69676889800289699,5.8510147513369692E-2,4.4680292831281287E-3,"","","","","","",1.3990492450295673E-6,"",8.7077797177485927E-2,8.7077797177485927E-2,null,8.7352086664870321E-2,0.7892613267237405,null,-5.0666132858498969E-3]
[18.992858655983582,9.7909307963235488,9.7893671989440918,2.0511708358164819E-10,0.23215587164314944,-1.5635973794569935E-3,2.6142415418351919E-10,1.6168616334848174E-5,5.6421391705949696E-2,5.6405223089614848E-2,0.48708556670720182,0.51291443329279818,1.0001231425232464,1.7658374403092754,50.008568122044039,1.0000072968694189,1.3597508534884994,2.6958834954241593,1,1.0000000000000002,12681.505723356075,2.6958834954241593,1.2312792548059841E-4,0.43369647624098051,0.98000500196233298,7.2968161749366598E-6,0.26457115475643439,0.62924468455643989,1.276840278990899E-17,1.2768402789904273E-16,0.99992114501055196,0.62924468455643989,5.7689311932423326E-2,5.0779638421790153E-3,"","","","","","",1.9204563611484849E-6,"",8.724208864256755E-2,8.724208864256755E-2,null,8.7779035563738783E-2,0.78898250048244656,null,-1.5635973794569935E-3]
[19.522742176195607,9.9104195087946749,9.9238343238830566,1.5578215477149726E-10,0.24128351563210748,1.3414815088381715E-2,1.6900406014314413E-8,-1.3000156158413795E-4,5.5664947086820592E-2,5.579494864840473E-2,0.49396223797330741,0.50603776202669259,1.0000935181540676,1.5816253017704744,38.219400616651725,{"$f":"IF($A93=\"\",\"\",(1+(Y$5*$AU93^(-2*Y$4))*$D93+(Y$6*$AU93^(-4*Y$4-2))*$D93^2+(Y$7*$AU93^(-6*Y$4-6))*$D93^3+(Y$8*$AU93^(-8*Y$4-12))*$D93^4+(Y$9*$AU93^(-10*Y$4-20))*$D93^5+(Y$10*$AU93^(-12*Y$4-30))*$D93^6))","v":1.0000055417033711},1.2732232837886244,2.2878448670945435,1,1,9631.3767107924086,2.2878448670945435,9.3509734794081214E-5,0.36773900961482253,0.97383646664762791,{"$f":"IF($A93=\"\",\"\",((Y$5*$AU93^(-2*Y$4))*$D93+2*(Y$6*$AU93^(-4*Y$4-2))*$D93^2+3*(Y$7*$AU93^(-6*Y$4-6))*$D93^3+4*(Y$8*$AU93^(-8*Y$4-12))*$D93^4+5*(Y$9*$AU93^(-10*Y$4-20))*$D93^5+6*(Y$10*$AU93^(-12*Y$4-30))*$D93^6)/P93)","v":5.5416726606855226E-6},0.21459180590510152,0.56303016665639138,9.6971312930727449E-18,9.6971312930700254E-17,0.99989617268330089,0.56303016665639138,5.6916804825006009E-2,5.5933850939397928E-3,"",{"$f":"IF(E$11=0,\"\",IF($A93=\"\",\"\",0.5*E$11*$L93*(1*Y$4^2+(Y$5*$AU93^(-2*Y$4))*$D93*(Y$4+1)^2+(Y$6*$AU93^(-4*Y$4-2))*$D93^2*(Y$4+2)^2+(Y$7*$AU93^(-6*Y$4-6))*$D93^3*(Y$4+3)^2+(Y$8*$AU93^(-8*Y$4-12))*$D93^4*(Y$4+4)^2+(Y$9*$AU93^(-10*Y$4-20))*$D93^5*(Y$4+5)^2+(Y$10*$AU93^(-12*Y$4-30))*$D93^6*(Y$4+6)^2)/P93))","v":""},"","","","",2.5643386859731051E-6,"",8.7340906966884957E-2,8.7340906966884957E-2,null,8.7791829006028665E-2,0.78897416876484538,null,1.3414815088381715E-2]
[20.01457771868445,10.036854231377124,10.05817174911499,1.1646116279324994E-10,0.31094452927920996,2.1317517737866609E-2,3.4877608668966178E-8,-1.8675547828368028E-4,5.4980746452728303E-2,5.5167501931011984E-2,0.50018215509841113,0.49981784490158893,{"$f":"IF($A94=\"\",\"\",(1+(V$5*$AU94^(-2*V$4))*$D94+(V$6*$AU94^(-4*V$4-2))*$D94^2+(V$7*$AU94^(-6*V$4-6))*$D94^3+(V$8*$AU94^(-8*V$4-12))*$D94^4+(V$9*$AU94^(-10*V$4-20))*$D94^5+(V$10*$AU94^(-12*V$4-30))*$D94^6))","v":1.0000698184384618},1.4346207196859913,28.799699714440088,1.0000041410494374,1.2042589626449003,1.9618569342673535,1,1,7197.3191439503607,1.9618569342673535,{"$f":"IF($A94=\"\",\"\",((V$5*$AU94^(-2*V$4))*$D94+2*(V$6*$AU94^(-4*V$4-2))*$D94^2+3*(V$7*$AU94^(-6*V$4-6))*$D94^3+4*(V$8*$AU94^(-8*V$4-12))*$D94^4+5*(V$9*$AU94^(-10*V$4-20))*$D94^5+6*(V$10*$AU94^(-12*V$4-30))*$D94^6)/M94)","v":6.9813745730211988E-5},0.30295166175540006,0.96527829630641815,4.1410322890335386E-6,0.16961381976870538,0.49035872429777905,7.2462016452097923E-18,7.2462016452082737E-17,0.99986105937780456,0.49035872429777905,{"$f":"IF(B$11=0,\"\",IF($A94=\"\",\"\",0.5*B$11*$L94*(1*V$4^2+(V$5*$AU94^(-2*V$4))*$D94*(V$4+1)^2+(V$6*$AU94^(-4*V$4-2))*$D94^2*(V$4+2)^2+(V$7*$AU94^(-6*V$4-6))*$D94^3*(V$4+3)^2+(V$8*$AU94^(-8*V$4-12))*$D94^4*(V$4+4)^2+(V$9*$AU94^(-10*V$4-20))*$D94^5*(V$4+5)^2+(V$10*$AU94^(-12*V$4-30))*$D94^6*(V$4+6)^2)/M94))","v":5.6217957200126872E-2},6.0907398907691038E-3,"","","","","","",3.4747809920228049E-6,"",8.7467921043480279E-2,8.7467921043480279E-2,null,8.8066054076375341E-2,0.78879590381472442,null,2.1317517737866609E-2]
[20.455753986025229,10.197805033857744,10.192595958709717,8.0391366804154108E-11,0.38714818041287591,-5.2090751480271535E-3,1.5562764340120457E-9,3.9449669631215489E-5,5.438117289135052E-2,5.4341723221719304E-2,0.5056327461624206,0.4943672538375794,1.0000482084883608,1.3000409470176715,20.193399386731482,1.0000028587785823,1.140996850754215,1.6640495480571507,1,1,4968.9877894173242,1.6640495480571507,4.8206250961887263E-5,0.23079346316431476,0.95047946641030279,2.8587704096424412E-6,0.12357339168904277,0.39910124720644341,5.0024242356341632E-18,5.0024242356334394E-17,0.99979875176949928,0.39910124720644341,5.5605559178738322E-2,6.6479547758627588E-3,"","","","","","",5.0878847724207469E-6,"",8.7717203437094174E-2,8.7717203437094174E-2,null,8.8007559601991789E-2,0.78883387735267241,null,-5.2090751480271535E-3]
[20.842108858050779,10.356007453144326,10.32694673538208,5.5851758507399283E-11,0.38698794714262941,-2.9060717762245503E-2,3.4919063961232861E-8,1.8686643347919085E-4,5.3866742278424536E-2,5.3679875844945345E-2,0.51030932145273866,0.48969067854726139,1.000033478929665,1.20842425009803,14.330910809451712,1.000001985858235,1.0979573102397022,1.4612045392967579,1,1,3452.026086559355,1.4612045392967579,3.3477850609954161E-5,0.17247605937003188,0.93022117146455718,1.9858542913735066E-6,8.9217776798914517E-2,0.31565778014564644,3.4749474565907014E-18,3.4749474565903519E-17,0.99971031505124086,0.31565778014564644,5.5079996912479896E-2,7.0843138937081588E-3,"","","","","","",7.3914464818162133E-6,"",8.7907650663924572E-2,8.7907650663924572E-2,null,8.8091110992204152E-2,0.78877964591071104,null,-2.9060717762245503E-2]
[21.177144151879475,10.478128327161683,10.461276531219482,4.216485895069566E-11,0.34022923777854752,-1.6851795942200098E-2,8.8121981315114074E-9,9.3873308940888023E-5,5.3428458852058679E-2,5.3334585543117791E-2,0.51429365945750938,0.48570634054249068,1.0000252625500181,1.1573231733390956,11.06085475184876,1.0000014989691466,1.0739521239765333,1.3480650002160555,1,1,2605.9098251367,1.3480650002160555,2.5261935611571193E-5,0.13593711631146754,0.90959137424526881,1.4989668996404694E-6,6.8859795819118913E-2,0.25821123757340037,2.6229661974335727E-18,2.6229661974333737E-17,0.99961625686723543,0.25821123757340037,5.4632091280457554E-2,7.3369323348578134E-3,"","","","","","",9.8678330020596699E-6,"",8.7960502391783046E-2,8.7960502391783046E-2,null,8.8188242578494516E-2,0.78871667176382032,null,-1.6851795942200098E-2]
[21.470288751879707,10.570749402373007,10.595572948455811,3.40717279790824E-11,{"$f":"IF(A98=\"\",\"\",IF(A99=\"\",(B98-B97)/(A98-A97),(B99-B97)/(A99-A97)))","v":0.47983358132050208},2.482354608280346E-2,1.5308058134195277E-8,-1.2372573755769362E-4,5.3050784505672417E-2,5.3174510243230111E-2,0.51772701367811269,0.48227298632188731,1.0000203954417841,1.1270887297036831,9.1249374650447042,1.0000012108965324,1.0597577393665689,1.2810869006901378,1,1,2105.2969973375916,1.2810869006901378,2.039504131895198E-5,0.11275840785533482,0.89041044538757308,1.2108950660180719E-6,5.6388113194895832E-2,0.2194232842848359,2.1188832872891203E-18,2.1188832872889903E-17,0.9995250076349016,0.2194232842848359,5.424605538759493E-2,7.4804929697230441E-3,"","","","","","",1.2295818935115628E-5,"",8.7937256573802774E-2,8.7937256573802774E-2,null,8.8369453540696918E-2,0.78859939191618178,null,2.482354608280346E-2]
[21.735162340337411,10.745884192971433,10.729918003082275,2.276575659509539E-11,0.55014634983043886,-1.5966189889157434E-2,5.2049126166564847E-9,7.2145080335782319E-5,5.2714095946803853E-2,5.2641950866468071E-2,0.52078777514015273,0.47921222485984727,1.0000136233721912,1.0849081792511313,6.4277150677605768,1.0000008090018708,1.0399284166018132,1.1877719820383486,1,1,1406.8841214038405,1.1877719820383486,1.3623193514114697E-5,7.826301000190132E-2,0.84442387035730992,8.0900121624043069E-7,3.8395351030302505E-2,0.15809259944128068,1.4156292445774824E-18,1.4156292445774244E-17,0.999289209406243,0.15809259944128068,5.3901983790648464E-2,7.7220088446802206E-3,"","","","","","",1.8508552595664085E-5,"",8.8111518146613402E-2,8.8111518146613402E-2,null,8.8433292028622004E-2,0.78855813941741004,null,-1.5966189889157434E-2]
[21.988459561252967,10.85581918173839,10.864291667938232,1.7674786453146919E-11,0.49012031388826194,8.4724861998424217E-3,1.4202919492026292E-9,-3.7686760927448104E-5,5.2396095854732774E-2,5.2433782615660222E-2,0.52367864387061158,0.47632135612938847,1.0000105758237368,1.065918522254433,5.2136727836839816,1.0000006280691489,1.0309994633343913,1.1457711169795379,1,1,1092.4590875330885,1.1457711169795379,1.0575716058365759E-5,6.1841989926065578E-2,0.80819674373698125,6.2806875446550148E-7,3.0067390369084027E-2,0.12722848206940682,1.0990247204931961E-18,1.0990247204931613E-17,0.99908463391314895,0.12722848206940682,5.3576908421655196E-2,7.8121654855248532E-3,"","","","","","",2.3967883550364555E-5,"",8.8128610150190009E-2,8.8128610150190009E-2,null,8.8453184606294741E-2,0.78854529159506581,null,8.4724861998424217E-3]
[22.249723532004282,10.998081085745918,10.998663425445557,1.2738311437660967E-11,0.48349190418929328,5.8233969963872312E-4,7.6034176182018882E-12,-2.7574295309584773E-6,5.2072088715502514E-2,5.2074846145033472E-2,0.52662412134247594,0.47337587865752412,1.0000076199881398,1.0475035391533609,4.0362680682024417,1.0000004526118975,1.0223414760569014,1.1050383291364503,1,1,787.54933064329043,1.1050383291364503,7.6199322400124105E-6,4.5349287628396649E-2,0.75224646124458705,4.5261169268051979E-7,2.1853242365819831E-2,9.5055707420697133E-2,7.9200143013893607E-19,7.9200143013891779E-18,0.99873023827068308,9.5055707420697133E-2,5.3245686805231507E-2,7.9003442334067576E-3,"","","","","","",3.3434357750791046E-5,"",8.8219438538336192E-2,8.8219438538336192E-2,null,8.8508286149954346E-2,0.78850972051797641,null,5.8233969963872312E-4]
[22.542090514907613,11.12349526573901,11.13300085067749,9.5445448857093547E-12,0.40397555387360456,9.5055849384806379E-3,2.637690526175819E-9,-5.1358451360762614E-5,5.1714227611664866E-2,5.1765586063025629E-2,0.5298773577431134,0.4701226422568866,1.0000057049569893,1.0355839573285357,3.2738054099402323,1.0000003390425798,1.0167399911739992,1.0786609265668148,1,1,590.18847600075287,1.0786609265668148,5.7049256563074239E-6,3.4361248214355093E-2,0.69454512258535372,3.3904246475981559E-7,1.6464377637659327E-2,7.2925582256652452E-2,5.9327253540769894E-19,5.9327253540768879E-18,0.9983056260149703,7.2925582256652452E-2,5.2879816504627988E-2,7.9363578857768492E-3,"","","","","","",4.4890520510810308E-5,"",8.8276134449148891E-2,8.8276134449148891E-2,null,8.8670332515646988E-2,0.78840525361644598,null,9.5055849384806379E-3]
[22.894093060167506,11.25839062278493,11.267337322235107,6.9970803068041717E-12,0.36422634592545394,8.9466994501776753E-3,3.4808046534609593E-9,-5.8998344497629418E-5,5.1289844242143064E-2,5.1348842586640693E-2,0.53373533339553259,0.46626466660446736,1.0000041789968026,1.0260796582874754,2.6660458816291523,1.0000002484859833,1.0122720427199248,1.0576356480402918,1,1,432.81914782308542,1.0576356480402918,4.178979990038367E-6,2.5416796949132434E-2,0.62491271598439724,2.4848592161903163E-7,1.212326548795167E-2,5.4495337567569177E-2,4.3481237515966818E-19,4.3481237515966271E-18,0.99768956617323978,5.4495337567569177E-2,5.2445912403603114E-2,7.944138689398807E-3,"","","","","","",6.1658008440709813E-5,"",8.8368349056167764E-2,8.8368349056167764E-2,null,8.8831131820846274E-2,0.78830180103023795,null,8.9466994501776753E-3]
[23.34278826485388,11.415130481392671,11.401691913604736,4.8777192746193979E-12,0.26167590461603374,-1.343856778793473E-2,1.3349826543255367E-8,1.1554144945973011E-4,5.0758879159326226E-2,5.0643337709866496E-2,0.53856221990642561,0.46143778009357433,1.0000029116096438,1.018177001194863,2.1609878779435188,1.0000001731897699,1.0085549367292126,1.0401634146309611,1,1,301.96932571538275,1.0401634146309611,2.9116014826227372E-6,1.7852496366919161E-2,0.53724869726843205,1.7318973993537463E-7,8.4823705855396735E-3,3.861286391479974E-2,3.0305554541579468E-19,3.0305554541579204E-18,0.99668840536160108,3.861286391479974E-2,5.1903015963758709E-2,7.9229197299005676E-3,"","","","","","",8.9174987994317079E-5,"",8.8575756461263463E-2,8.8575756461263463E-2,null,8.8943613901642987E-2,0.78822955825432606,null,-1.343856778793473E-2]
[23.938857322791591,11.531780256317591,11.535930156707764,{"$f":"IF(A105=\"\",\"\",10^-((((B105-P$12)/P$13)+7))/$AU105)","v":3.7302211652813044E-12},0.16723201792154671,4.1499003901730447E-3,2.1204119298547676E-9,-4.6047930787981861E-5,5.0070290535816908E-2,5.011633846660489E-2,0.54482202727593987,0.45517797272406013,1.00000222149627,1.0138900850761827,1.8864928589795327,1.0000001323441976,1.0065423621693443,1.0306674376418421,1,1,230.98785639973485,1.0306674376418421,2.2214915191746612E-6,1.3699793786560704E-2,0.46991584442269257,1.3234418015998584E-7,6.4998378759180547E-3,2.9755085151104775E-2,2.3158205606023519E-19,2.3158205606023363E-18,0.99567076808458077,2.9755085151104775E-2,5.1198925752474263E-2,7.8484835181569304E-3,"","","","","","",1.1793304543531954E-4,"",8.86507409757121E-2,8.86507409757121E-2,null,8.9418765036448855E-2,{"$f":"IF(A105=\"\",\"\",10^(-$P$16*($AT105^0.5/(1+$AT105^0.5)-$P$17*$AT105)))","v":0.78792551044043047},null,4.1499003901730447E-3]
[24.755057577276602,11.651307128357798,11.670268535614014,2.8333465076852969E-12,0.13659935066442438,1.8961407256215423E-2,{"$f":"IF(A106=\"\",\"\",IF(AX106=\"X\",0,IF(ABS(E106)<0.00001,(0.00001^M$20)*(ABS(H106)^I$20)*ABS(F106)^K$20,((ABS(E106))^M$20)*((ABS(H106))^I$20)*ABS(F106)^K$20)))","v":7.6423799565086604E-8},{"$f":"IF(A106=\"\",\"\",I106-J106)","v":-2.7644854777170852E-4},{"$f":"IF(A106=\"\",\"\",L106*I$18+K106*E$19)","v":4.9157156108341121E-2},{"$f":"IF(A106=\"\",\"\",D106 -$AC$9/AU106^2/D106+L106*(W106*$B$11+X106*$C$11+Y106*$D$11+Z106*$E$11+AA106*$F$11+AB106*$G$11+AC106*$H$11)+K106*(AD106*$B$18+AE106*$C$18+AF106*$D$18))","v":4.943360465611283E-2},{"$f":"IF(A106=\"\",\"\",A106/(A106+$G$16))","v":0.55312313104576227},{"$f":"IF(A106=\"\",\"\",$E$16/(A106+$G$16))","v":0.44687686895423773},1.0000016852285398,1.0105459583838787,1.6727789970394678,1.0000001004814869,1.0049693511947906,1.0232741662860076,1,{"$f":"IF($A106=\"\",\"\",(1+(AC$5*$AU106^(-2*AC$4))*$D106+(AC$6*$AU106^(-4*AC$4-2))*$D106^2))","v":1},175.61681116950101,1.0232741662860076,1.6852258057605637E-6,1.0435901804440331E-2,0.40219240743837525,1.004814767808634E-7,4.9447788520940606E-3,2.2744889970825008E-2,1.7582719708048651E-19,{"$f":"IF($A106=\"\",\"\",((AC$5*$AU106^(-2*AC$4))*$D106+2*(AC$6*$AU106^(-4*AC$4-2))*$D106^2)/T106)","v":1.7582719708048564E-18},0.99430578431904892,2.2744889970825008E-2,5.0265223322620962E-2,7.73084908506581E-3,"","","","","",{"$f":"IF(B$18=0,\"\",IF($A106=\"\",\"\",0.5*B$18*$K106*(1*AC$4^2+(AC$5*$AU106^(-2*AC$4))*$D106*(AC$4+1)^2+(AC$6*$AU106^(-4*AC$4-2))*$D106^2*(AC$4+2)^2)/T106))","v":""},1.5748012031487735E-4,"",{"$f":"IF(A106=\"\",\"\",SUM(AG106:AP106)+0.5*(D106+ $AC$9/AU106^2/D106)+$L106*$S$16+$K106*$T$16)","v":8.8742109674094363E-2},{"$f":"IF(A106=\"\",\"\",AQ106+$L106*S$14+$K106*$T$14)","v":8.8742109674094363E-2},null,8.9680731652911433E-2,0.78775865114379418,null,{"$f":"IF(C106=\"\",\"\",C106-B106)","v":1.8961407256215423E-2}]
[25.90093998122029,11.799799473408878,11.804811954498291,2.0125074890895395E-12,0.11063322971440334,{"$f":"IF(A107=\"\",\"\",IF(C107=\"\",\"0,00001\",(IF(ABS(C107-B107)<0.00001,0.00001,C107-B107))))","v":5.012481089412546E-3},1.0008480258867472E-8,-1.0004239230879813E-4,4.7929984720663503E-2,4.8030027112972301E-2,0.56427907558793544,0.43572092441206461,1.0000011981623071,1.0074931348460199,1.4781780071020554,1.0000000713943014,1.0035296976449246,1.0165421064451452,1,1,125.06907604676684,1.0165421064451452,1.1981609253367274E-6,7.4374053680684119E-3,0.32349149583149794,7.1394296248684412E-8,3.5172827004603148E-3,1.6272963824001438E-2,1.249290817966725E-19,1.2492908179667205E-18,0.99200441842533427,1.6272963824001438E-2,4.9010403133107762E-2,7.56069485011615E-3,"","","","","","",2.2558696898701628E-4,"",8.9107917319715582E-2,8.9107917319715582E-2,null,8.9481748808360476E-2,0.78788534305196611,null,5.012481089412546E-3]
[27.550263459561393,11.960549782831663,11.939309597015381,1.3900343364068947E-12,{"$f":"IF(A108=\"\",\"\",IF(A109=\"\",(B108-B107)/(A108-A107),(B109-B107)/(A109-A107)))","v":6.5643246598049709E-2},-2.1240185816282064E-2,3.5096305902118259E-7,5.9242135260402506E-4,4.6267490270268934E-2,4.5675068917664909E-2,0.57939244612159124,0.42060755387840876,1.0000008271298135,1.0051745776241898,1.3301598728466384,1.0000000493031771,1.0024379541195145,1.0114215521370231,1,1,86.679102011089341,1.0114215521370231,8.2712915505086134E-7,5.1479392147289818E-3,0.24821067239532696,4.9303174661561859E-8,2.4320249542586067E-3,1.1292595332176194E-2,8.6273001173750157E-20,8.6273001173749948E-19,0.98846319381721259,1.1292595332176194E-2,4.7310443154405933E-2,7.3152801277101579E-3,"","","","","","",3.342169177337961E-4,"",8.9830223425166916E-2,8.9830223425166916E-2,null,8.95909053276049E-2,0.78781580431202669,null,-2.1240185816282064E-2]
[29.996509932680055,12.068645981692114,12.073429584503174,1.085016053310453E-12,4.2263742714422035E-2,4.7836028110594953E-3,3.1067697709329772E-8,-1.7626031234889428E-4,4.4003698556685407E-2,4.4179958869034301E-2,0.59997207751241322,0.40002792248758678,1.0000006411258695,1.004029692183416,1.2565119401131726,1.0000000383947525,1.0019029885000865,1.0088737714301943,1,1,67.722432777075184,1.0088737714301943,6.4112547400180827E-7,4.013518938500423E-3,0.20414604437397374,3.8394751062065754E-8,1.8993740131820554E-3,8.7957335099433549E-3,6.7184930586072594E-20,6.7184930586072472E-19,0.98523384410463011,8.7957335099433549E-3,4.4995626132215243E-2,6.9652889857704983E-3,"","","","","","",4.4296406147086216E-4,"",8.9957969487899275E-2,8.9957969487899275E-2,null,9.1047402877749845E-2,0.7868969364013898,null,4.7836028110594953E-3]
[33.77778212656267,12.223748029523065,12.208112239837646,7.5928341277667184E-13,2.732191666991881E-2,-1.5635789685418899E-2,6.473443771842957E-7,8.0457714184799939E-4,4.0909670591962009E-2,4.010509345011401E-2,0.62809920362778737,0.37190079637221263,1.00000044822107,1.0028190321482577,1.1793891397268297,1.0000000268596301,1.0013316923730409,1.006205783261751,1,1,47.676687563466004,1.006205783261751,4.4822087659414118E-7,2.8111075461919326E-3,0.15210343621599026,2.6859629445187158E-8,1.3299213269530263E-3,6.1675155568261045E-3,4.7000234904755013E-20,4.7000234904754954E-19,0.97902538848428122,6.1675155568261045E-3,4.1831857339201292E-2,6.4833569074362928E-3,"","","","","","",6.58706839471259E-4,"",9.1148279102884186E-2,9.1148279102884186E-2,null,9.1249923737146327E-2,0.78677048258473459,null,-1.5635789685418899E-2]
[39.999999982537702,12.341960503242687,12.342258930206299,5.7939030543030349E-13,1.8998446607925372E-2,2.9842696361193077E-4,4.241218988672624E-10,-2.059422003541922E-5,3.6667189210071241E-2,3.668778343010666E-2,0.6666666665696539,0.3333333334303461,1.0000003383614404,1.0021434224216563,1.1359077793794063,1.0000000204224466,1.0010161813596503,1.0047015890216564,1,1,36.490144643454293,1.0047015890216564,3.3836133037882524E-7,2.1388379886332905E-3,0.1196468432191703,2.042244619263961E-8,1.0151497833632448E-3,4.6795912854270217E-3,3.5736150573625299E-20,3.5736150573625262E-19,0.97259534020018246,4.6795912854270217E-3,3.7493744131554908E-2,5.814926832655414E-3,"","","","","","",9.1348865986098872E-4,"",9.1695369091915391E-2,9.1695369091915391E-2,null,9.3545301548133758E-2,0.78535908608477767,null,2.9842696361193077E-4]
[null,null,null,{"$f":"IF(A112=\"\",\"\",10^-((((B112-P$12)/P$13)+7))/$AU112)","v":""},{"$f":"IF(A112=\"\",\"\",IF(A113=\"\",(B112-B111)/(A112-A111),(B113-B111)/(A113-A111)))","v":""},{"$f":"IF(A112=\"\",\"\",IF(C112=\"\",\"0,00001\",(IF(ABS(C112-B112)<0.00001,0.00001,C112-B112))))","v":""},{"$f":"IF(A112=\"\",\"\",IF(AX112=\"X\",0,IF(ABS(E112)<0.00001,(0.00001^M$20)*(ABS(H112)^I$20)*ABS(F112)^K$20,((ABS(E112))^M$20)*((ABS(H112))^I$20)*ABS(F112)^K$20)))","v":""},"",{"$f":"IF(A112=\"\",\"\",L112*I$18+K112*E$19)","v":""},{"$f":"IF(A112=\"\",\"\",D112 -$AC$9/AU112^2/D112+L112*(W112*$B$11+X112*$C$11+Y112*$D$11+Z112*$E$11+AA112*$F$11+AB112*$G$11+AC112*$H$11)+K112*(AD112*$B$18+AE112*$C$18+AF112*$D$18))","v":""},{"$f":"IF(A112=\"\",\"\",A112/(A112+$G$16))","v":""},{"$f":"IF(A112=\"\",\"\",$E$16/(A112+$G$16))","v":""},{"$f":"IF($A112=\"\",\"\",(1+(V$5*$AU112^(-2*V$4))*$D112+(V$6*$AU112^(-4*V$4-2))*$D112^2+(V$7*$AU112^(-6*V$4-6))*$D112^3+(V$8*$AU112^(-8*V$4-12))*$D112^4+(V$9*$AU112^(-10*V$4-20))*$D112^5+(V$10*$AU112^(-12*V$4-30))*$D112^6))","v":""},{"$f":"IF($A112=\"\",\"\",(1+(W$5*$AU112^(-2*W$4))*$D112+(W$6*$AU112^(-4*W$4-2))*$D112^2+(W$7*$AU112^(-6*W$4-6))*$D112^3+(W$8*$AU112^(-8*W$4-12))*$D112^4+(W$9*$AU112^(-10*W$4-20))*$D112^5+(W$10*$AU112^(-12*W$4-30))*$D112^6))","v":""},{"$f":"IF($A112=\"\",\"\",(1+(X$5*$AU112^(-2*X$4))*$D112+(X$6*$AU112^(-4*X$4-2))*$D112^2+(X$7*$AU112^(-6*X$4-6))*$D112^3+(X$8*$AU112^(-8*X$4-12))*$D112^4+(X$9*$AU112^(-10*X$4-20))*$D112^5+(X$10*$AU112^(-12*X$4-30))*$D112^6))","v":""},{"$f":"IF($A112=\"\",\"\",(1+(Y$5*$AU112^(-2*Y$4))*$D112+(Y$6*$AU112^(-4*Y$4-2))*$D112^2+(Y$7*$AU112^(-6*Y$4-6))*$D112^3+(Y$8*$AU112^(-8*Y$4-12))*$D112^4+(Y$9*$AU112^(-10*Y$4-20))*$D112^5+(Y$10*$AU112^(-12*Y$4-30))*$D112^6))","v":""},{"$f":"IF($A112=\"\",\"\",(1+(Z$5*$AU112^(-2*Z$4))*$D112+(Z$6*$AU112^(-4*Z$4-2))*$D112^2+(Z$7*$AU112^(-6*Z$4-6))*$D112^3+(Z$8*$AU112^(-8*Z$4-12))*$D112^4+(Z$9*$AU112^(-10*Z$4-20))*$D112^5+(Z$10*$AU112^(-12*Z$4-30))*$D112^6))","v":""},{"$f":"IF($A112=\"\",\"\",(1+(AA$5*$AU112^(-2*AA$4))*$D112+(AA$6*$AU112^(-4*AA$4-2))*$D112^2+(AA$7*$AU112^(-6*AA$4-6))*$D112^3+(AA$8*$AU112^(-8*AA$4-12))*$D112^4+(AA$9*$AU112^(-10*AA$4-20))*$D112^5+(AA$10*$AU112^(-12*AA$4-30))*$D112^6))","v":""},{"$f":"IF($A112=\"\",\"\",(1+(AB$5*$AU112^(-2*AB$4))*$D112+(AB$6*$AU112^(-4*AB$4-2))*$D112^2+(AB$7*$AU112^(-6*AB$4-6))*$D112^3+(AB$8*$AU112^(-8*AB$4-12))*$D112^4+(AB$9*$AU112^(-10*AB$4-20))*$D112^5+(AB$10*$AU112^(-12*AB$4-30))*$D112^6))","v":""},{"$f":"IF($A112=\"\",\"\",(1+(AC$5*$AU112^(-2*AC$4))*$D112+(AC$6*$AU112^(-4*AC$4-2))*$D112^2))","v":""},{"$f":"IF($A112=\"\",\"\",(1+(AD$5*$AU112^(-2*AD$4))*$D112+(AD$6*$AU112^(-4*AD$4-2))*$D112^2))","v":""},{"$f":"IF($A112=\"\",\"\",(1+(AE$5*$AU112^(-2*AE$4))*$D112+(AE$6*$AU112^(-4*AE$4-2))*$D112^2))","v":""},{"$f":"IF($A112=\"\",\"\",((V$5*$AU112^(-2*V$4))*$D112+2*(V$6*$AU112^(-4*V$4-2))*$D112^2+3*(V$7*$AU112^(-6*V$4-6))*$D112^3+4*(V$8*$AU112^(-8*V$4-12))*$D112^4+5*(V$9*$AU112^(-10*V$4-20))*$D112^5+6*(V$10*$AU112^(-12*V$4-30))*$D112^6)/M112)","v":""},{"$f":"IF($A112=\"\",\"\",((W$5*$AU112^(-2*W$4))*$D112+2*(W$6*$AU112^(-4*W$4-2))*$D112^2+3*(W$7*$AU112^(-6*W$4-6))*$D112^3+4*(W$8*$AU112^(-8*W$4-12))*$D112^4+5*(W$9*$AU112^(-10*W$4-20))*$D112^5+6*(W$10*$AU112^(-12*W$4-30))*$D112^6)/N112)","v":""},{"$f":"IF($A112=\"\",\"\",((X$5*$AU112^(-2*X$4))*$D112+2*(X$6*$AU112^(-4*X$4-2))*$D112^2+3*(X$7*$AU112^(-6*X$4-6))*$D112^3+4*(X$8*$AU112^(-8*X$4-12))*$D112^4+5*(X$9*$AU112^(-10*X$4-20))*$D112^5+6*(X$10*$AU112^(-12*X$4-30))*$D112^6)/O112)","v":""},{"$f":"IF($A112=\"\",\"\",((Y$5*$AU112^(-2*Y$4))*$D112+2*(Y$6*$AU112^(-4*Y$4-2))*$D112^2+3*(Y$7*$AU112^(-6*Y$4-6))*$D112^3+4*(Y$8*$AU112^(-8*Y$4-12))*$D112^4+5*(Y$9*$AU112^(-10*Y$4-20))*$D112^5+6*(Y$10*$AU112^(-12*Y$4-30))*$D112^6)/P112)","v":""},{"$f":"IF($A112=\"\",\"\",((Z$5*$AU112^(-2*Z$4))*$D112+2*(Z$6*$AU112^(-4*Z$4-2))*$D112^2+3*(Z$7*$AU112^(-6*Z$4-6))*$D112^3+4*(Z$8*$AU112^(-8*Z$4-12))*$D112^4+5*(Z$9*$AU112^(-10*Z$4-20))*$D112^5+6*(Z$10*$AU112^(-12*Z$4-30))*$D112^6)/Q112)","v":""},{"$f":"IF($A112=\"\",\"\",((AA$5*$AU112^(-2*AA$4))*$D112+2*(AA$6*$AU112^(-4*AA$4-2))*$D112^2+3*(AA$7*$AU112^(-6*AA$4-6))*$D112^3+4*(AA$8*$AU112^(-8*AA$4-12))*$D112^4+5*(AA$9*$AU112^(-10*AA$4-20))*$D112^5+6*(AA$10*$AU112^(-12*AA$4-30))*$D112^6)/R112)","v":""},{"$f":"IF($A112=\"\",\"\",((AB$5*$AU112^(-2*AB$4))*$D112+2*(AB$6*$AU112^(-4*AB$4-2))*$D112^2+3*(AB$7*$AU112^(-6*AB$4-6))*$D112^3+4*(AB$8*$AU112^(-8*AB$4-12))*$D112^4+5*(AB$9*$AU112^(-10*AB$4-20))*$D112^5+6*(AB$10*$AU112^(-12*AB$4-30))*$D112^6)/S112)","v":""},{"$f":"IF($A112=\"\",\"\",((AC$5*$AU112^(-2*AC$4))*$D112+2*(AC$6*$AU112^(-4*AC$4-2))*$D112^2)/T112)","v":""},{"$f":"IF($A112=\"\",\"\",((AD$5*$AU112^(-2*AD$4))*$D112+2*(AD$6*$AU112^(-4*AD$4-2))*$D112^2)/U112)","v":""},{"$f":"IF($A112=\"\",\"\",((AE$5*$AU112^(-2*AE$4))*$D112+2*(AE$6*$AU112^(-4*AE$4-2))*$D112^2)/V112)","v":""},{"$f":"IF(B$11=0,\"\",IF($A112=\"\",\"\",0.5*B$11*$L112*(1*V$4^2+(V$5*$AU112^(-2*V$4))*$D112*(V$4+1)^2+(V$6*$AU112^(-4*V$4-2))*$D112^2*(V$4+2)^2+(V$7*$AU112^(-6*V$4-6))*$D112^3*(V$4+3)^2+(V$8*$AU112^(-8*V$4-12))*$D112^4*(V$4+4)^2+(V$9*$AU112^(-10*V$4-20))*$D112^5*(V$4+5)^2+(V$10*$AU112^(-12*V$4-30))*$D112^6*(V$4+6)^2)/M112))","v":""},{"$f":"IF(C$11=0,\"\",IF($A112=\"\",\"\",0.5*C$11*$L112*(1*W$4^2+(W$5*$AU112^(-2*W$4))*$D112*(W$4+1)^2+(W$6*$AU112^(-4*W$4-2))*$D112^2*(W$4+2)^2+(W$7*$AU112^(-6*W$4-6))*$D112^3*(W$4+3)^2+(W$8*$AU112^(-8*W$4-12))*$D112^4*(W$4+4)^2+(W$9*$AU112^(-10*W$4-20))*$D112^5*(W$4+5)^2+(W$10*$AU112^(-12*W$4-30))*$D112^6*(W$4+6)^2)/N112))","v":""},{"$f":"IF(D$11=0,\"\",IF($A112=\"\",\"\",0.5*D$11*$L112*(1*X$4^2+(X$5*$AU112^(-2*X$4))*$D112*(X$4+1)^2+(X$6*$AU112^(-4*X$4-2))*$D112^2*(X$4+2)^2+(X$7*$AU112^(-6*X$4-6))*$D112^3*(X$4+3)^2+(X$8*$AU112^(-8*X$4-12))*$D112^4*(X$4+4)^2+(X$9*$AU112^(-10*X$4-20))*$D112^5*(X$4+5)^2+(X$10*$AU112^(-12*X$4-30))*$D112^6*(X$4+6)^2)/O112))","v":""},{"$f":"IF(E$11=0,\"\",IF($A112=\"\",\"\",0.5*E$11*$L112*(1*Y$4^2+(Y$5*$AU112^(-2*Y$4))*$D112*(Y$4+1)^2+(Y$6*$AU112^(-4*Y$4-2))*$D112^2*(Y$4+2)^2+(Y$7*$AU112^(-6*Y$4-6))*$D112^3*(Y$4+3)^2+(Y$8*$AU112^(-8*Y$4-12))*$D112^4*(Y$4+4)^2+(Y$9*$AU112^(-10*Y$4-20))*$D112^5*(Y$4+5)^2+(Y$10*$AU112^(-12*Y$4-30))*$D112^6*(Y$4+6)^2)/P112))","v":""},{"$f":"IF(F$11=0,\"\",IF($A112=\"\",\"\",0.5*F$11*$L112*(1*Z$4^2+(Z$5*$AU112^(-2*Z$4))*$D112*(Z$4+1)^2+(Z$6*$AU112^(-4*Z$4-2))*$D112^2*(Z$4+2)^2+(Z$7*$AU112^(-6*Z$4-6))*$D112^3*(Z$4+3)^2+(Z$8*$AU112^(-8*Z$4-12))*$D112^4*(Z$4+4)^2+(Z$9*$AU112^(-10*Z$4-20))*$D112^5*(Z$4+5)^2+(Z$10*$AU112^(-12*Z$4-30))*$D112^6*(Z$4+6)^2)/Q112))","v":""},{"$f":"IF(G$11=0,\"\",IF($A112=\"\",\"\",0.5*G$11*$L112*(1*AA$4^2+(AA$5*$AU112^(-2*AA$4))*$D112*(AA$4+1)^2+(AA$6*$AU112^(-4*AA$4-2))*$D112^2*(AA$4+2)^2+(AA$7*$AU112^(-6*AA$4-6))*$D112^3*(AA$4+3)^2+(AA$8*$AU112^(-8*AA$4-12))*$D112^4*(AA$4+4)^2+(AA$9*$AU112^(-10*AA$4-20))*$D112^5*(AA$4+5)^2+(AA$10*$AU112^(-12*AA$4-30))*$D112^6*(AA$4+6)^2)/R112))","v":""},{"$f":"IF(H$11=0,\"\",IF($A112=\"\",\"\",0.5*H$11*$L112*(1*AB$4^2+(AB$5*$AU112^(-2*AB$4))*$D112*(AB$4+1)^2+(AB$6*$AU112^(-4*AB$4-2))*$D112^2*(AB$4+2)^2+(AB$7*$AU112^(-6*AB$4-6))*$D112^3*(AB$4+3)^2+(AB$8*$AU112^(-8*AB$4-12))*$D112^4*(AB$4+4)^2+(AB$9*$AU112^(-10*AB$4-20))*$D112^5*(AB$4+5)^2+(AB$10*$AU112^(-12*AB$4-30))*$D112^6*(AB$4+6)^2)/S112))","v":""},{"$f":"IF(B$18=0,\"\",IF($A112=\"\",\"\",0.5*B$18*$K112*(1*AC$4^2+(AC$5*$AU112^(-2*AC$4))*$D112*(AC$4+1)^2+(AC$6*$AU112^(-4*AC$4-2))*$D112^2*(AC$4+2)^2)/T112))","v":""},{"$f":"IF(C$18=0,\"\",IF($A112=\"\",\"\",0.5*C$18*$K112*(1*AD$4^2+(AD$5*$AU112^(-2*AD$4))*$D112*(AD$4+1)^2+(AD$6*$AU112^(-4*AD$4-2))*$D112^2*(AD$4+2)^2)/U112))","v":""},{"$f":"IF(D$18=0,\"\",IF($A112=\"\",\"\",0.5*D$18*$K112*(1*AE$4^2+(AE$5*$AU112^(-2*AE$4))*$D112*(AE$4+1)^2+(AE$6*$AU112^(-4*AE$4-2))*$D112^2*(AE$4+2)^2)/V112))","v":""},{"$f":"IF(A112=\"\",\"\",SUM(AG112:AP112)+0.5*(D112+ $AC$9/AU112^2/D112)+$L112*$S$16+$K112*$T$16)","v":""},{"$f":"IF(A112=\"\",\"\",AQ112+$L112*S$14+$K112*$T$14)","v":""},null,null,{"$f":"IF(A112=\"\",\"\",10^(-$P$16*($AT112^0.5/(1+$AT112^0.5)-$P$17*$AT112)))","v":""},null,{"$f":"IF(C112=\"\",\"\",C112-B112)","v":""}]
[null,null,null,"","","","","","","","","","","","","","","","","","","","","","","","","","","","","","","","","","","","","","","","","",null,null,"",null,""]
[null,null,null,"","","","","","","","","","","","","","","","","","","","","","","","","","","","","","","","","","","","","","","","","",null,null,"",null,""]
[null,null,null,"","","","","","","","","","","","","","","","","","","","","","","","","","","","","","","","","","","","","","","","","",null,null,"",null,""]
[null,null,null,"","","","","","","","","","","","","","","","","","","","","","","","","","","","","","","","","","","","","","","","","",null,null,"",null,""]
[null,null,null,"","","","","","","","","","","","","","","","","","","","","","","","","","","","","","","","","","","","","","","","","",null,null,"",null,""]
[null,null,null,"","","","","","","","","","","","","","","","","","","","","","","","","","","","","","","","","","","","","","","","","",null,null,"",null,""]
[null,null,null,"","","","","","","","","","","","","","","","","","","","","","","","","","","","","","","","","","","","","","","","","",null,null,"",null,""]
[null,null,null,"","","","","","","","","","","","","","","","","","","","","","","","","","","","","","","","","","","","","","","","","",null,null,"",null,""]
[null,null,null,"","","","","","","","","","","","","","","","","","","","","","","","","","","","","","","","","","","","","","","","","",null,null,"",null,""]
[null,null,null,"","","","","","","","","","","","","","","","","","","","","","","","","","","","","","","","","","","","","","","","","",null,null,"",null,""]
[null,null,null,"","","","","","","","","","","","","","","","","","","","","","","","","","","","","","","","","","","","","","","","","",null,null,"",null,""]
[null,null,null,"","","","","","","","","","","","","","","","","","","","","","","","","","","","","","","","","","","","","","","","","",null,null,"",null,""]
[null,null,null,"","","","","","","","","","","","","","","","","","","","","","","","","","","","","","","","","","","","","","","","","",null,null,"",null,""]
[null,null,null,"","","","","","","","","","","","","","","","","","","","","","","","","","","","","","","","","","","","","","","","","",null,null,"",null,""]
[null,null,null,"","","","","","","","","","","","","","","","","","","","","","","","","","","","","","","","","","","","","","","","","",null,null,"",null,""]
[null,null,null,"","","","","","","","","","","","","","","","","","","","","","","","","","","","","","","","","","","","","","","","","",null,null,"",null,""]
[null,null,null,"","","","","","","","","","","","","","","","","","","","","","","","","","","","","","","","","","","","","","","","","",null,null,"",null,""]
[null,null,null,"","","","","","","","","","","","","","","","","","","","","","","","","","","","","","","","","","","","","","","","","",null,null,"",null,""]
[null,null,null,"","","","","","","","","","","","","","","","","","","","","","","","","","","","","","","","","","","","","","","","","",null,null,"",null,""]
[null,null,null,"","","","","","","","","","","","","","","","","","","","","","","","","","","","","","","","","","","","","","","","","",null,null,"",null,""]
[null,null,null,"","","","","","","","","","","","","","","","","","","","","","","","","","","","","","","","","","","","","","","","","",null,null,"",null,""]
[null,null,null,"","","","","","","","","","","","","","","","","","","","","","","","","","","","","","","","","","","","","","","","","",null,null,"",null,""]
[null,null,null,"","","","","","","","","","","","","","","","","","","","","","","","","","","","","","","","","","","","","","","","","",null,null,"",null,""]
[null,null,null,"","","","","","","","","","","","","","","","","","","","","","","","","","","","","","","","","","","","","","","","","",null,null,"",null,""]
[null,null,null,"","","","","","","","","","","","","","","","","","","","","","","","","","","","","","","","","","","","","","","","","",null,null,"",null,""]
[null,null,null,"","","","","","","","","","","","","","","","","","","","","","","","","","","","","","","","","","","","","","","","","",null,null,"",null,""]
[null,null,null,"","","","","","","","","","","","","","","","","","","","","","","","","","","","","","","","","","","","","","","","","",null,null,"",null,""]
[null,null,null,"","","","","","","","","","","","","","","","","","","","","","","","","","","","","","","","","","","","","","","","","",null,null,"",null,""]
[null,null,null,"","","","","","","","","","","","","","","","","","","","","","","","","","","","","","","","","","","","","","","","","",null,null,"",null,""]
[null,null,null,"","","","","","","","","","","","","","","","","","","","","","","","","","","","","","","","","","","","","","","","","",null,null,"",null,""]
[null,null,null,"","","","","","","","","","","","","","","","","","","","","","","","","","","","","","","","","","","","","","","","","",null,null,"",null,""]
[null,null,null,"","","","","","","","","","","","","","","","","","","","","","","","","","","","","","","","","","","","","","","","","",null,null,"",null,""]
[null,null,null,"","","","","","","","","","","","","","","","","","","","","","","","","","","","","","","","","","","","","","","","","",null,null,"",null,""]
[null,null,null,"","","","","","","","","","","","","","","","","","","","","","","","","","","","","","","","","","","","","","","","","",null,null,"",null,""]
[null,null,null,"","","","","","","","","","","","","","","","","","","","","","","","","","","","","","","","","","","","","","","","","",null,null,"",null,""]
[null,null,null,"","","","","","","","","","","","","","","","","","","","","","","","","","","","","","","","","","","","","","","","","",null,null,"",null,""]
[null,null,null,"","","","","","","","","","","","","","","","","","","","","","","","","","","","","","","","","","","","","","","","","",null,null,"",null,""]
[null,null,null,"","","","","","","","","","","","","","","","","","","","","","","","","","","","","","","","","","","","","","","","","",null,null,"",null,""]
[null,null,null,"","","","","","","","","","","","","","","","","","","","","","","","","","","","","","","","","","","","","","","","","",null,null,"",null,""]
[null,null,null,"","","","","","","","","","","","","","","","","","","","","","","","","","","","","","","","","","","","","","","","","",null,null,"",null,""]
[null,null,null,"","","","","","","","","","","","","","","","","","","","","","","","","","","","","","","","","","","","","","","","","",null,null,"",null,""]
[null,null,null,"","","","","","","","","","","","","","","","","","","","","","","","","","","","","","","","","","","","","","","","","",null,null,"",null,""]
[null,null,null,"","","","","","","","","","","","","","","","","","","","","","","","","","","","","","","","","","","","","","","","","",null,null,"",null,""]
[null,null,null,"","","","","","","","","","","","","","","","","","","","","","","","","","","","","","","","","","","","","","","","","",null,null,"",null,""]
[null,null,null,"","","","","","","","","","","","","","","","","","","","","","","","","","","","","","","","","","","","","","","","","",null,null,"",null,""]
[null,null,null,"","","","","","","","","","","","","","","","","","","","","","","","","","","","","","","","","","","","","","","","","",null,null,"",null,""]
[null,null,null,"","","","","","","","","","","","","","","","","","","","","","","","","","","","","","","","","","","","","","","","","",null,null,"",null,""]
[null,null,null,"","","","","","","","","","","","","","","","","","","","","","","","","","","","","","","","","","","","","","","","","",null,null,"",null,""]
[null,null,null,"","","","","","","","","","","","","","","","","","","","","","","","","","","","","","","","","","","","","","","","","",null,null,"",null,""]
[null,null,null,"","","","","","","","","","","","","","","","","","","","","","","","","","","","","","","","","","","","","","","","","",null,null,"",null,""]
[null,null,null,"","","","","","","","","","","","","","","","","","","","","","","","","","","","","","","","","","","","","","","","","",null,null,"",null,""]
[null,null,null,"","","","","","","","","","","","","","","","","","","","","","","","","","","","","","","","","","","","","","","","","",null,null,"",null,""]
[null,null,null,"","","","","","","","","","","","","","","","","","","","","","","","","","","","","","","","","","","","","","","","","",null,null,"",null,""]
[null,null,null,"","","","","","","","","","","","","","","","","","","","","","","","","","","","","","","","","","","","","","","","","",null,null,"",null,""]
[null,null,null,"","","","","","","","","","","","","","","","","","","","","","","","","","","","","","","","","","","","","","","","","",null,null,"",null,""]
[null,null,null,"","","","","","","","","","","","","","","","","","","","","","","","","","","","","","","","","","","","","","","","","",null,null,"",null,""]
[null,null,null,"","","","","","","","","","","","","","","","","","","","","","","","","","","","","","","","","","","","","","","","","",null,null,"",null,""]
[null,null,null,"","","","",{"$f":"IF(A170=\"\",\"\",I170-J170)","v":""},"","","","","","","","","","","","","","","","","","","","","","","","","","","","","","","","","","","","",null,null,"",null,""]
[null,null,null,"","","","","","","","","","","","","","","","","","","","","","","","","","","","","","","","","","","","","","","","","",null,null,"",null,""]
[null,null,null,"","","","","","","","","","","","","","","","","","","","","","","","","","","","","","","","","","","","","","","","","",null,null,"",null,""]
[null,null,null,"","","","","","","","","","","","","","","","","","","","","","","","","","","","","","","","","","","","","","","","","",null,null,"",null,""]
[null,null,null,"","","","","","","","","","","","","","","","","","","","","","","","","","","","","","","","","","","","","","","","","",null,null,"",null,""]
[null,null,null,"","","","","","","","","","","","","","","","","","","","","","","","","","","","","","","","","","","","","","","","","",null,null,"",null,""]
[null,null,null,{"$f":"IF(A176=\"\",\"\",10^-((((B176-P$12)/P$13)+7))/$AU176)","v":""},{"$f":"IF(A176=\"\",\"\",IF(A177=\"\",(B176-B175)/(A176-A175),(B177-B175)/(A177-A175)))","v":""},{"$f":"IF(A176=\"\",\"\",IF(C176=\"\",\"0,00001\",(IF(ABS(C176-B176)<0.00001,0.00001,C176-B176))))","v":""},{"$f":"IF(A176=\"\",\"\",IF(AX176=\"X\",0,IF(ABS(E176)<0.00001,(0.00001^M$20)*(ABS(H176)^I$20)*ABS(F176)^K$20,((ABS(E176))^M$20)*((ABS(H176))^I$20)*ABS(F176)^K$20)))","v":""},"",{"$f":"IF(A176=\"\",\"\",L176*I$18+K176*E$19)","v":""},{"$f":"IF(A176=\"\",\"\",D176 -$AC$9/AU176^2/D176+L176*(W176*$B$11+X176*$C$11+Y176*$D$11+Z176*$E$11+AA176*$F$11+AB176*$G$11+AC176*$H$11)+K176*(AD176*$B$18+AE176*$C$18+AF176*$D$18))","v":""},{"$f":"IF(A176=\"\",\"\",A176/(A176+$G$16))","v":""},{"$f":"IF(A176=\"\",\"\",$E$16/(A176+$G$16))","v":""},{"$f":"IF($A176=\"\",\"\",(1+(V$5*$AU176^(-2*V$4))*$D176+(V$6*$AU176^(-4*V$4-2))*$D176^2+(V$7*$AU176^(-6*V$4-6))*$D176^3+(V$8*$AU176^(-8*V$4-12))*$D176^4+(V$9*$AU176^(-10*V$4-20))*$D176^5+(V$10*$AU176^(-12*V$4-30))*$D176^6))","v":""},{"$f":"IF($A176=\"\",\"\",(1+(W$5*$AU176^(-2*W$4))*$D176+(W$6*$AU176^(-4*W$4-2))*$D176^2+(W$7*$AU176^(-6*W$4-6))*$D176^3+(W$8*$AU176^(-8*W$4-12))*$D176^4+(W$9*$AU176^(-10*W$4-20))*$D176^5+(W$10*$AU176^(-12*W$4-30))*$D176^6))","v":""},{"$f":"IF($A176=\"\",\"\",(1+(X$5*$AU176^(-2*X$4))*$D176+(X$6*$AU176^(-4*X$4-2))*$D176^2+(X$7*$AU176^(-6*X$4-6))*$D176^3+(X$8*$AU176^(-8*X$4-12))*$D176^4+(X$9*$AU176^(-10*X$4-20))*$D176^5+(X$10*$AU176^(-12*X$4-30))*$D176^6))","v":""},{"$f":"IF($A176=\"\",\"\",(1+(Y$5*$AU176^(-2*Y$4))*$D176+(Y$6*$AU176^(-4*Y$4-2))*$D176^2+(Y$7*$AU176^(-6*Y$4-6))*$D176^3+(Y$8*$AU176^(-8*Y$4-12))*$D176^4+(Y$9*$AU176^(-10*Y$4-20))*$D176^5+(Y$10*$AU176^(-12*Y$4-30))*$D176^6))","v":""},{"$f":"IF($A176=\"\",\"\",(1+(Z$5*$AU176^(-2*Z$4))*$D176+(Z$6*$AU176^(-4*Z$4-2))*$D176^2+(Z$7*$AU176^(-6*Z$4-6))*$D176^3+(Z$8*$AU176^(-8*Z$4-12))*$D176^4+(Z$9*$AU176^(-10*Z$4-20))*$D176^5+(Z$10*$AU176^(-12*Z$4-30))*$D176^6))","v":""},{"$f":"IF($A176=\"\",\"\",(1+(AA$5*$AU176^(-2*AA$4))*$D176+(AA$6*$AU176^(-4*AA$4-2))*$D176^2+(AA$7*$AU176^(-6*AA$4-6))*$D176^3+(AA$8*$AU176^(-8*AA$4-12))*$D176^4+(AA$9*$AU176^(-10*AA$4-20))*$D176^5+(AA$10*$AU176^(-12*AA$4-30))*$D176^6))","v":""},{"$f":"IF($A176=\"\",\"\",(1+(AB$5*$AU176^(-2*AB$4))*$D176+(AB$6*$AU176^(-4*AB$4-2))*$D176^2+(AB$7*$AU176^(-6*AB$4-6))*$D176^3+(AB$8*$AU176^(-8*AB$4-12))*$D176^4+(AB$9*$AU176^(-10*AB$4-20))*$D176^5+(AB$10*$AU176^(-12*AB$4-30))*$D176^6))","v":""},{"$f":"IF($A176=\"\",\"\",(1+(AC$5*$AU176^(-2*AC$4))*$D176+(AC$6*$AU176^(-4*AC$4-2))*$D176^2))","v":""},{"$f":"IF($A176=\"\",\"\",(1+(AD$5*$AU176^(-2*AD$4))*$D176+(AD$6*$AU176^(-4*AD$4-2))*$D176^2))","v":""},{"$f":"IF($A176=\"\",\"\",(1+(AE$5*$AU176^(-2*AE$4))*$D176+(AE$6*$AU176^(-4*AE$4-2))*$D176^2))","v":""},{"$f":"IF($A176=\"\",\"\",((V$5*$AU176^(-2*V$4))*$D176+2*(V$6*$AU176^(-4*V$4-2))*$D176^2+3*(V$7*$AU176^(-6*V$4-6))*$D176^3+4*(V$8*$AU176^(-8*V$4-12))*$D176^4+5*(V$9*$AU176^(-10*V$4-20))*$D176^5+6*(V$10*$AU176^(-12*V$4-30))*$D176^6)/M176)","v":""},{"$f":"IF($A176=\"\",\"\",((W$5*$AU176^(-2*W$4))*$D176+2*(W$6*$AU176^(-4*W$4-2))*$D176^2+3*(W$7*$AU176^(-6*W$4-6))*$D176^3+4*(W$8*$AU176^(-8*W$4-12))*$D176^4+5*(W$9*$AU176^(-10*W$4-20))*$D176^5+6*(W$10*$AU176^(-12*W$4-30))*$D176^6)/N176)","v":""},{"$f":"IF($A176=\"\",\"\",((X$5*$AU176^(-2*X$4))*$D176+2*(X$6*$AU176^(-4*X$4-2))*$D176^2+3*(X$7*$AU176^(-6*X$4-6))*$D176^3+4*(X$8*$AU176^(-8*X$4-12))*$D176^4+5*(X$9*$AU176^(-10*X$4-20))*$D176^5+6*(X$10*$AU176^(-12*X$4-30))*$D176^6)/O176)","v":""},{"$f":"IF($A176=\"\",\"\",((Y$5*$AU176^(-2*Y$4))*$D176+2*(Y$6*$AU176^(-4*Y$4-2))*$D176^2+3*(Y$7*$AU176^(-6*Y$4-6))*$D176^3+4*(Y$8*$AU176^(-8*Y$4-12))*$D176^4+5*(Y$9*$AU176^(-10*Y$4-20))*$D176^5+6*(Y$10*$AU176^(-12*Y$4-30))*$D176^6)/P176)","v":""},{"$f":"IF($A176=\"\",\"\",((Z$5*$AU176^(-2*Z$4))*$D176+2*(Z$6*$AU176^(-4*Z$4-2))*$D176^2+3*(Z$7*$AU176^(-6*Z$4-6))*$D176^3+4*(Z$8*$AU176^(-8*Z$4-12))*$D176^4+5*(Z$9*$AU176^(-10*Z$4-20))*$D176^5+6*(Z$10*$AU176^(-12*Z$4-30))*$D176^6)/Q176)","v":""},{"$f":"IF($A176=\"\",\"\",((AA$5*$AU176^(-2*AA$4))*$D176+2*(AA$6*$AU176^(-4*AA$4-2))*$D176^2+3*(AA$7*$AU176^(-6*AA$4-6))*$D176^3+4*(AA$8*$AU176^(-8*AA$4-12))*$D176^4+5*(AA$9*$AU176^(-10*AA$4-20))*$D176^5+6*(AA$10*$AU176^(-12*AA$4-30))*$D176^6)/R176)","v":""},{"$f":"IF($A176=\"\",\"\",((AB$5*$AU176^(-2*AB$4))*$D176+2*(AB$6*$AU176^(-4*AB$4-2))*$D176^2+3*(AB$7*$AU176^(-6*AB$4-6))*$D176^3+4*(AB$8*$AU176^(-8*AB$4-12))*$D176^4+5*(AB$9*$AU176^(-10*AB$4-20))*$D176^5+6*(AB$10*$AU176^(-12*AB$4-30))*$D176^6)/S176)","v":""},{"$f":"IF($A176=\"\",\"\",((AC$5*$AU176^(-2*AC$4))*$D176+2*(AC$6*$AU176^(-4*AC$4-2))*$D176^2)/T176)","v":""},{"$f":"IF($A176=\"\",\"\",((AD$5*$AU176^(-2*AD$4))*$D176+2*(AD$6*$AU176^(-4*AD$4-2))*$D176^2)/U176)","v":""},{"$f":"IF($A176=\"\",\"\",((AE$5*$AU176^(-2*AE$4))*$D176+2*(AE$6*$AU176^(-4*AE$4-2))*$D176^2)/V176)","v":""},{"$f":"IF(B$11=0,\"\",IF($A176=\"\",\"\",0.5*B$11*$L176*(1*V$4^2+(V$5*$AU176^(-2*V$4))*$D176*(V$4+1)^2+(V$6*$AU176^(-4*V$4-2))*$D176^2*(V$4+2)^2+(V$7*$AU176^(-6*V$4-6))*$D176^3*(V$4+3)^2+(V$8*$AU176^(-8*V$4-12))*$D176^4*(V$4+4)^2+(V$9*$AU176^(-10*V$4-20))*$D176^5*(V$4+5)^2+(V$10*$AU176^(-12*V$4-30))*$D176^6*(V$4+6)^2)/M176))","v":""},{"$f":"IF(C$11=0,\"\",IF($A176=\"\",\"\",0.5*C$11*$L176*(1*W$4^2+(W$5*$AU176^(-2*W$4))*$D176*(W$4+1)^2+(W$6*$AU176^(-4*W$4-2))*$D176^2*(W$4+2)^2+(W$7*$AU176^(-6*W$4-6))*$D176^3*(W$4+3)^2+(W$8*$AU176^(-8*W$4-12))*$D176^4*(W$4+4)^2+(W$9*$AU176^(-10*W$4-20))*$D176^5*(W$4+5)^2+(W$10*$AU176^(-12*W$4-30))*$D176^6*(W$4+6)^2)/N176))","v":""},{"$f":"IF(D$11=0,\"\",IF($A176=\"\",\"\",0.5*D$11*$L176*(1*X$4^2+(X$5*$AU176^(-2*X$4))*$D176*(X$4+1)^2+(X$6*$AU176^(-4*X$4-2))*$D176^2*(X$4+2)^2+(X$7*$AU176^(-6*X$4-6))*$D176^3*(X$4+3)^2+(X$8*$AU176^(-8*X$4-12))*$D176^4*(X$4+4)^2+(X$9*$AU176^(-10*X$4-20))*$D176^5*(X$4+5)^2+(X$10*$AU176^(-12*X$4-30))*$D176^6*(X$4+6)^2)/O176))","v":""},{"$f":"IF(E$11=0,\"\",IF($A176=\"\",\"\",0.5*E$11*$L176*(1*Y$4^2+(Y$5*$AU176^(-2*Y$4))*$D176*(Y$4+1)^2+(Y$6*$AU176^(-4*Y$4-2))*$D176^2*(Y$4+2)^2+(Y$7*$AU176^(-6*Y$4-6))*$D176^3*(Y$4+3)^2+(Y$8*$AU176^(-8*Y$4-12))*$D176^4*(Y$4+4)^2+(Y$9*$AU176^(-10*Y$4-20))*$D176^5*(Y$4+5)^2+(Y$10*$AU176^(-12*Y$4-30))*$D176^6*(Y$4+6)^2)/P176))","v":""},{"$f":"IF(F$11=0,\"\",IF($A176=\"\",\"\",0.5*F$11*$L176*(1*Z$4^2+(Z$5*$AU176^(-2*Z$4))*$D176*(Z$4+1)^2+(Z$6*$AU176^(-4*Z$4-2))*$D176^2*(Z$4+2)^2+(Z$7*$AU176^(-6*Z$4-6))*$D176^3*(Z$4+3)^2+(Z$8*$AU176^(-8*Z$4-12))*$D176^4*(Z$4+4)^2+(Z$9*$AU176^(-10*Z$4-20))*$D176^5*(Z$4+5)^2+(Z$10*$AU176^(-12*Z$4-30))*$D176^6*(Z$4+6)^2)/Q176))","v":""},{"$f":"IF(G$11=0,\"\",IF($A176=\"\",\"\",0.5*G$11*$L176*(1*AA$4^2+(AA$5*$AU176^(-2*AA$4))*$D176*(AA$4+1)^2+(AA$6*$AU176^(-4*AA$4-2))*$D176^2*(AA$4+2)^2+(AA$7*$AU176^(-6*AA$4-6))*$D176^3*(AA$4+3)^2+(AA$8*$AU176^(-8*AA$4-12))*$D176^4*(AA$4+4)^2+(AA$9*$AU176^(-10*AA$4-20))*$D176^5*(AA$4+5)^2+(AA$10*$AU176^(-12*AA$4-30))*$D176^6*(AA$4+6)^2)/R176))","v":""},{"$f":"IF(H$11=0,\"\",IF($A176=\"\",\"\",0.5*H$11*$L176*(1*AB$4^2+(AB$5*$AU176^(-2*AB$4))*$D176*(AB$4+1)^2+(AB$6*$AU176^(-4*AB$4-2))*$D176^2*(AB$4+2)^2+(AB$7*$AU176^(-6*AB$4-6))*$D176^3*(AB$4+3)^2+(AB$8*$AU176^(-8*AB$4-12))*$D176^4*(AB$4+4)^2+(AB$9*$AU176^(-10*AB$4-20))*$D176^5*(AB$4+5)^2+(AB$10*$AU176^(-12*AB$4-30))*$D176^6*(AB$4+6)^2)/S176))","v":""},{"$f":"IF(B$18=0,\"\",IF($A176=\"\",\"\",0.5*B$18*$K176*(1*AC$4^2+(AC$5*$AU176^(-2*AC$4))*$D176*(AC$4+1)^2+(AC$6*$AU176^(-4*AC$4-2))*$D176^2*(AC$4+2)^2)/T176))","v":""},{"$f":"IF(C$18=0,\"\",IF($A176=\"\",\"\",0.5*C$18*$K176*(1*AD$4^2+(AD$5*$AU176^(-2*AD$4))*$D176*(AD$4+1)^2+(AD$6*$AU176^(-4*AD$4-2))*$D176^2*(AD$4+2)^2)/U176))","v":""},{"$f":"IF(D$18=0,\"\",IF($A176=\"\",\"\",0.5*D$18*$K176*(1*AE$4^2+(AE$5*$AU176^(-2*AE$4))*$D176*(AE$4+1)^2+(AE$6*$AU176^(-4*AE$4-2))*$D176^2*(AE$4+2)^2)/V176))","v":""},{"$f":"IF(A176=\"\",\"\",SUM(AG176:AP176)+0.5*(D176+ $AC$9/AU176^2/D176)+$L176*$S$16+$K176*$T$16)","v":""},{"$f":"IF(A176=\"\",\"\",AQ176+$L176*S$14+$K176*$T$14)","v":""},null,null,{"$f":"IF(A176=\"\",\"\",10^(-$P$16*($AT176^0.5/(1+$AT176^0.5)-$P$17*$AT176)))","v":""},null,{"$f":"IF(C176=\"\",\"\",C176-B176)","v":""}]
[null,null,null,"","","","","","","","","","","","","","","","","","","","","","","","","","","","","","","","","","","","","","","","","",null,null,"",null,""]
[null,null,null,"","","","","","","","","","","","","","","","","","","","","","","","","","","","","","","","","","","","","","","","","",null,null,"",null,""]
[null,null,null,"","","","","","","","","","","","","","","","","","","","","","","","","","","","","","","","","","","","","","","","","",null,null,"",null,""]
[null,null,null,"","","","","","","","","","","","","","","","","","","","","","","","","","","","","","","","","","","","","","","","","",null,null,"",null,""]
[null,null,null,"","","","","","","","","","","","","","","","","","","","","","","","","","","","","","","","","","","","","","","","","",null,null,"",null,""]
[null,null,null,"","","","","","","","","","","","","","","","","","","","","","","","","","","","","","","","","","","","","","","","","",null,null,"",null,""]
[null,null,null,"","","","","","","","","","","","","","","","","","","","","","","","","","","","","","","","","","","","","","","","","",null,null,"",null,""]
[null,null,null,"","","","","","","","","","","","","","","","","","","","","","","","","","","","","","","","","","","","","","","","","",null,null,"",null,""]
[null,null,null,"","","","","","","","","","","","","","","","","","","","","","","","","","","","","","","","","","","","","","","","","",null,null,"",null,""]
[null,null,null,"","","","","","","","","","","","","","","","","","","","","","","","","","","","","","","","","","","","","","","","","",null,null,"",null,""]
[null,null,null,"","","","","","","","","","","","","","","","","","","","","","","","","","","","","","","","","","","","","","","","","",null,null,"",null,""]
[null,null,null,"","","","","","","","","","","","","","","","","","","","","","","","","","","","","","","","","","","","","","","","","",null,null,"",null,""]
[null,null,null,"","","","","","","","","","","","","","","","","","","","","","","","","","","","","","","","","","","","","","","","","",null,null,"",null,""]
[null,null,null,"","","","","","","","","","","","","","","","","","","","","","","","","","","","","","","","","","","","","","","","","",null,null,"",null,""]
[null,null,null,"","","","","","","","","","","","","","","","","","","","","","","","","","","","","","","","","","","","","","","","","",null,null,"",null,""]
[null,null,null,"","","","","","","","","","","","","","","","","","","","","","","","","","","","","","","","","","","","","","","","","",null,null,"",null,""]
[null,null,null,"","","","","","","","","","","","","","","","","","","","","","","","","","","","","","","","","","","","","","","","","",null,null,"",null,""]
[null,null,null,"","","","","","","","","","","","","","","","","","","","","","","","","","","","","","","","","","","","","","","","","",null,null,"",null,""]
[null,null,null,"","","","","","","","","","","","","","","","","","","","","","","","","","","","","","","","","","","","","","","","","",null,null,"",null,""]
[null,null,null,"","","","","","","","","","","","","","","","","","","","","","","","","","","","","","","","","","","","","","","","","",null,null,"",null,""]
[null,null,null,"","","","","","","","","","","","","","","","","","","","","","","","","","","","","","","","","","","","","","","","","",null,null,"",null,""]
[null,null,null,"","","","","","","","","","","","","","","","","","","","","","","","","","","","","","","","","","","","","","","","","",null,null,"",null,""]
[null,null,null,"","","","","","","","","","","","","","","","","","","","","","","","","","","","","","","","","","","","","","","","","",null,null,"",null,""]
[null,null,null,"","","","","","","","","","","","","","","","","","","","","","","","","","","","","","","","","","","","","","","","","",null,null,"",null,""]
[null,null,null,"","","","","","","","","","","","","","","","","","","","","","","","","","","","","","","","","","","","","","","","","",null,null,"",null,""]
[null,null,null,null,null,null,null,""]

{"sheet":"+II","index":9,"n_rows":4,"n_cols":3,"rows_kept":4,"cut":false,"hidden":false,"merged":[]}
[null,"           ","Compilação de dados e resultados da Analise_II"]
[]
[]
[null,"Identifique os resultados e acrescente observações (nas células em cinza)"]

{"sheet":"Graficos","index":10,"n_rows":311,"n_cols":41,"rows_kept":311,"cut":false,"hidden":false,"merged":[]}
["              Curvas de Titulação e derivada 1ª ","              Curvas de Titulação e derivada 1ª "]
["       Origem dos dados das curvas (sobrepostas)",null,null,null,null,null,null,"Habilite as macros. instruções na célula A22 da planilha pH"]
[true,false,{"$f":"IF(Simulador!B41=\"\",\"Não há dados\",\"\")","v":""},false,null,false,{"$f":"IF(Simulador!D41=\"\",\"Não há dados\",\"\")","v":"Não há dados"},"Atualizar curva(s) após cada alteração no Simulador, Analise Inicial ou Analise"]
[false,false,{"$f":"IF(Analise_I!B41=\"\",\"Não há dados\",\"\")","v":""},true,null,true,{"$f":"IF(Analise_I!C41=\"\",\"Não há dados\",\"\")","v":""},"Para ampliar uma região da curva",null,null,null,"Para identificar dados"]
[true,false,{"$f":"IF(Analise_II!B41=\"\",\"Não há dados\",\"\")","v":""},false,null,true,{"$f":"IF(Analise_II!C41=\"\",\"Não há dados\",\"\")","v":""},"Para copiar/colar gráfico"]
[]
[]
[]
[null,null,null,null,null,null,null,null,null,null,null,null,null,null,null,null,null,null,"Simulador",null,null,null,"Simulador com dispersão",null,null,null,"Analise Inicial",null,null,"    Anal. Inicial c/ Interp/Alisamento",null,null,null,null,"Analise",null,null,null,"Analise curva ajustada"]
[null,null,null,null,null,null,null,null,null,null,null,null,null,null,null,null,null,"Vol","pH","Vol_","dpH/dVol","Vol","pH","Vol_","dpH/dVol","Vol","pH","Vol_","dpH/dVol","Vol","pH","Vol_","dpH/dVol","Vol","pH","Vol_","dpH/dVol","Vol","pH","Vol_","dpH/dVol"]
[null,null,null,null,null,null,null,null,null,null,null,null,null,null,null,null,null,0,1.8171072800722754,null,null,null,null,null,null,null,null,null,null,0,2.2644307566907886,null,null,0,2.2808282657451926]
[null,null,null,null,null,null,null,null,null,null,null,null,null,null,null,null,null,2.3004448812571354,2.03204784726322,null,null,null,null,null,null,null,null,null,null,0.16666666662786156,2.2679243808824325,8.333333331393078E-2,2.0961745154743913E-2,0.89688894076971337,2.4714166043065489,null,null,null,null,0.44844447038485669,0.22481004002439334]
[null,null,null,null,null,null,null,null,null,null,null,null,null,null,null,null,null,4.3254298929241486,2.2461396194374883,null,null,null,null,null,null,null,null,null,null,0.33333333325572312,2.2715480454288626,0.24999999994179234,2.1741987283642433E-2,1.8641394926817156,2.662466105993837,null,null,null,null,1.3805142167257145,0.20858267652116036]
[null,null,null,null,null,null,null,null,null,null,null,null,null,null,null,null,null,5.9982889695675112,2.4592837415154789,null,null,null,null,null,null,null,null,null,null,0.49999999988358468,2.2754317906848645,0.4166666665696539,2.330247154143681E-2,2.9605798234115355,2.8605852687023581,null,null,null,null,2.4123596580466256,0.18396434987294444]
[null,null,null,null,null,null,null,null,null,null,null,null,null,null,null,null,null,7.2857926934375428,2.6715840969865385,null,null,null,null,null,null,null,null,null,null,0.66666666651144624,2.2797056570052248,0.58333333319751546,2.5643197928132376E-2,4.1980953348684125,3.0949879734255372,null,null,null,null,3.579337579139974,0.16288167837050094]
[null,null,null,null,null,null,null,null,null,null,null,null,null,null,null,null,null,8.2150732792797498,2.8832299762264122,null,null,null,null,null,null,null,null,null,null,0.8333333331393078,2.2844996847447288,0.74999999982537702,2.8764166443721133E-2,5.5483564428868704,3.2735308732353152,null,null,null,null,4.8732258888776414,0.14912299500667947]
[null,null,null,null,null,null,null,null,null,null,null,null,null,null,null,null,null,8.852646873856429,3.0944106420923969,null,null,null,null,null,null,null,null,null,null,0.99999999976716936,2.289943914258163,0.91666666645323858,3.2665377088211073E-2,6.9703873581602238,3.4831263395957648,null,null,null,null,6.2593719005235471,0.14139289189638488]
[null,null,null,null,null,null,null,null,null,null,null,null,null,null,null,null,null,9.2745251997257583,3.3052786795679925,null,null,null,null,null,null,null,null,null,null,1.1666666663950309,2.2961683859003137,1.0833333330811001,3.734682986159954E-2,8.4402233464061283,3.6744159386791289,null,null,null,null,7.705305352283176,0.13659697278468405]
[null,null,null,null,null,null,null,null,null,null,null,null,null,null,null,null,null,9.5472193221212365,3.5159445293883027,null,null,null,null,null,null,null,null,null,null,1.3333333330228925,2.3033031400259665,1.2499999997089617,4.280852476388386E-2,9.9575227286550216,3.8778446124009789,null,null,null,null,9.1988730375305749,0.13215305391683108]
[null,null,null,null,null,null,null,null,null,null,null,null,null,null,null,null,null,9.7213898246991448,3.7264837975794283,null,null,null,null,null,null,null,null,null,null,1.499999999650754,2.3114782169899075,1.4166666663368233,4.9050461795066697E-2,11.527829080296215,4.0878315094076099,null,null,null,null,10.742675904475618,0.12761438336434969]
[null,null,null,null,null,null,null,null,null,null,null,null,null,null,null,null,null,9.8327682426315732,3.9369472311575628,null,null,null,null,null,null,null,null,null,null,1.6666666662786156,2.320823657146923,1.5833333329646848,5.6072640955148065E-2,13.142040256934706,4.2595044983066614,null,null,null,null,12.33493466861546,0.12416231360342218]
[null,null,null,null,null,null,null,null,null,null,null,null,null,null,null,null,null,9.9056407503667288,4.1473695514894615,null,null,null,null,null,null,null,null,null,null,1.8333333329064772,2.3314695008517985,1.7499999995925464,6.3875062244125286E-2,14.768722133885603,4.4838214059062302,null,null,null,null,13.955381195410155,0.12327610499679047]
[null,null,null,null,null,null,null,null,null,null,null,null,null,null,null,null,null,9.956512633652892,4.3577764259656462,null,null,null,null,null,null,null,null,null,null,1.9999999995343387,2.3435457884593207,1.9166666662204079,7.2457725662003689E-2,16.356732237909455,4.6824077536202964,null,null,null,null,15.562727185897529,0.12633581995819387]
[null,null,null,null,null,null,null,null,null,null,null,null,null,null,null,null,null,9.9971799951163121,4.568190022913047,null,null,null,null,null,null,null,null,null,null,2.1666666661622003,2.3571825603242749,2.0833333328482695,8.182063120877528E-2,17.844781892199535,4.8893591124005615,null,null,null,null,17.100757065054495,0.13483274352060043]
[null,null,null,null,null,null,null,null,null,null,null,null,null,null,null,null,null,10.037190483126324,4.7786339196049799,null,null,null,null,null,null,null,null,null,null,2.3333333327900618,2.3725098568014475,2.2499999994761311,9.1963778884448066E-2,19.181782512168866,5.0960081052444872,null,null,null,null,18.5132822021842,0.15003137472010025]
[null,null,null,null,null,null,null,null,null,null,null,null,null,null,null,null,null,10.085949620406609,4.989138153184598,null,null,null,null,null,null,null,null,null,null,2.4999999994179234,2.3896577182205925,2.4166666661039926,0.10288716853882485,20.351667587237898,5.295324570912868,null,null,null,null,19.766725049703382,0.17151520302969492]
[null,null,null,null,null,null,null,null,null,null,null,null,null,null,null,null,null,10.154803957266267,5.1997450596983432,null,null,null,null,null,null,null,null,null,null,2.666666666045785,2.4086742286120146,2.5833333327318542,0.11409906237509872,21.384160743036773,5.5011578789688649,null,null,null,null,20.867914165137336,0.19464875831228878]
[null,null,null,null,null,null,null,null,null,null,null,null,null,null,null,null,null,10.259427917480934,5.4105160650546065,null,null,null,null,null,null,null,null,null,null,2.8333333326736465,2.4292862472257863,2.7499999993597157,0.12367211171142492,22.342685637704562,5.6875888803489509,null,null,null,null,21.863423190370668,0.21032225893686496]
[null,null,null,null,null,null,null,null,null,null,null,null,null,null,null,null,null,10.422738817578647,5.6215382068211683,null,null,null,null,null,null,null,null,null,null,2.9999999993015081,2.451141944130991,2.9166666659875773,0.13113418146175973,23.297000558522996,5.8781362815611065,null,null,null,null,22.819843098113779,0.21187367970080889]
[null,null,null,null,null,null,null,null,null,null,null,null,null,null,null,null,null,10.678157336951699,5.8329258111339772,null,null,null,null,null,null,null,null,null,null,3.1666666659293696,2.4738894893967114,3.0833333326154388,0.1364852716261005,24.292349834286142,6.0934056529216472,null,null,null,null,23.794675196404569,0.20335357832945014]
[null,null,null,null,null,null,null,null,null,null,null,null,null,null,null,null,null,11.071775054733735,6.0448065155412518,null,null,null,null,null,null,null,null,null,null,3.3333333325572312,2.4971770530920319,3.2499999992433004,0.13972538220445521,25.326453409797978,6.3068681297414004,null,null,null,null,24.80940162204206,0.19561460901190675]
[null,null,null,null,null,null,null,null,null,null,null,null,null,null,null,null,null,11.659035268530715,6.2572748607294768,null,null,null,null,null,null,null,null,null,null,3.4999999991850927,2.5206528052860344,3.416666665871162,0.14085451319681055,26.347641290340107,6.4901526380963626,null,null,null,null,25.837047350069042,0.19787949642274566]
[null,null,null,null,null,null,null,null,null,null,null,null,null,null,null,null,null,12.487507292826194,6.4703073210120445,null,null,null,null,null,null,null,null,null,null,3.6666666658129543,2.5439649160478033,3.5833333324990235,0.13987266460317985,27.280329070345033,6.6984786649681629,null,null,null,null,26.81398518034257,0.21642668086285677]
[null,null,null,null,null,null,null,null,null,null,null,null,null,null,null,null,null,13.560292513284367,6.6836852438660559,null,null,null,null,null,null,null,null,null,null,3.8333333324408159,2.5667615554464214,3.7499999991268851,0.13677983642355507,28.062663164746482,6.8921215216629204,null,null,null,null,27.671496117545757,0.25788433666403349]
[null,null,null,null,null,null,null,null,null,null,null,null,null,null,null,null,null,14.799194350780454,6.8970304591995308,null,null,null,null,null,null,null,null,null,null,3.9999999990686774,2.588690893550972,3.9166666657547466,0.13157602865793894,28.669746332161594,7.0865812115333977,null,null,null,null,28.366204748454038,0.33222906621987203]
[null,null,null,null,null,null,null,null,null,null,null,null,null,null,null,null,null,16.054576211899985,7.1099804688999608,null,null,null,null,null,null,null,null,null,null,4.166666665696539,2.6094011004305386,4.0833333323826082,0.1242612413063314,29.111924824246671,7.3027161829434339,null,null,null,null,28.890835578204133,0.45619856012227311]
[null,null,null,null,null,null,null,null,null,null,null,null,null,null,null,null,null,17.173922529036645,7.322349098093679,null,null,null,null,null,null,null,null,null,null,4.3333333323244005,2.6285403461542045,4.2499999990104698,0.11483547436873248,29.419084104301874,7.5183351617865268,null,null,null,null,29.265504464274272,0.65712897127013326]
[null,null,null,null,null,null,null,null,null,null,null,null,null,null,null,null,null,18.068469061108772,7.5341386806955644,null,null,null,null,null,null,null,null,null,null,4.4999999989522621,2.6457568007910526,4.4166666656383313,0.10329872784513951,29.625479625246953,7.7038716139905157,null,null,null,null,29.522281864774413,0.97897901970164791]
[null,null,null,null,null,null,null,null,null,null,null,null,null,null,null,null,null,18.725484058086295,7.7454546772478645,null,null,null,null,null,null,null,null,null,null,4.6666666655801237,2.6607031883228145,4.5833333322661929,8.9678325211451373E-2,29.761181406502146,7.9083233626820144,null,null,null,null,29.69333051587455,1.491900927229004]
[null,null,null,null,null,null,null,null,null,null,null,null,null,null,null,null,null,19.179874857945833,7.9564249462523851,null,null,null,null,null,null,null,null,null,null,4.8333333322079852,2.6734011972501506,4.7499999988940544,7.6188053581755386E-2,29.849311058933381,8.1149909251295025,null,null,null,null,29.805246232717764,2.3041502972248251]
[null,null,null,null,null,null,null,null,null,null,null,null,null,null,null,null,null,19.48181740444852,8.1671594790759396,null,null,null,null,null,null,null,null,null,null,4.9999999988358468,2.6845075345688132,4.916666665521916,6.6638023927491088E-2,29.90638507908443,8.2506355920545751,null,null,null,null,29.877848069008905,3.573411756690962]
[null,null,null,null,null,null,null,null,null,null,null,null,null,null,null,null,null,19.677734184369911,8.377740060160809,null,null,null,null,null,null,null,null,null,null,5.1666666654637083,2.694741640417718,5.0833333321497776,6.1404635107725855E-2,29.94375132402638,8.5722924061678345,null,null,null,null,29.925068201555405,5.4891424839924525]
[null,null,null,null,null,null,null,null,null,null,null,null,null,null,null,null,null,19.803712518478278,8.5882232426729104,null,null,null,null,null,null,null,null,null,null,5.3333333320915699,2.7048229549357816,5.2499999987776391,6.0487887122465035E-2,29.969121598696802,8.6735323605053125,null,null,null,null,29.956436461361591,8.1170826828921339]
[null,null,null,null,null,null,null,null,null,null,null,null,null,null,null,null,null,19.885540132236201,8.7986468997393832,null,null,null,null,null,null,null,null,null,null,5.4999999987194315,2.7154709182619201,5.4166666654055007,6.3887779971705957E-2,29.987858388631139,8.949234131556004,null,null,null,null,29.97848999366397,10.944396928693651]
[null,null,null,null,null,null,null,null,null,null,null,null,null,null,null,null,null,19.941073826339561,9.0090364657241615,null,null,null,null,null,null,null,null,null,null,5.666666665347293,2.7274049705350492,5.5833333320333622,7.1604313655445964E-2,30.003981960180681,9.1845845668949195,null,null,null,null,29.99592017440591,12.497700508861254]
[null,null,null,null,null,null,null,null,null,null,null,null,null,null,null,null,null,19.982924718351569,9.2194099000282304,null,null,null,null,null,null,null,null,null,null,5.8333333319751546,2.7413445518940849,5.7499999986612238,8.3637488173687713E-2,30.020979327673558,9.2019186423607167,null,null,null,null,30.01248064392712,11.622714051159788]
[null,null,null,null,null,null,null,null,null,null,null,null,null,null,null,null,null,20.020832466252614,9.4297815209616029,null,null,null,null,null,null,null,null,null,null,5.9999999986030161,2.7580091024779434,5.9166666652890854,9.9987303526431218E-2,30.042530830542091,9.5545939252935348,null,null,null,null,30.031755079107825,9.0994098289813419]
[null,null,null,null,null,null,null,null,null,null,null,null,null,null,null,null,null,20.063731157279108,9.6401651822701666,null,null,null,null,null,null,null,null,null,null,6.1666666652308777,2.7781180624255408,6.0833333319169469,0.12065375971367645,30.073280991928186,9.7397145399264993,null,null,null,null,30.057905911235139,6.3992296261242183]
[null,null,null,null,null,null,null,null,null,null,null,null,null,null,null,null,null,20.121755062427837,9.8505773086917063,null,null,null,null,null,null,null,null,null,null,6.3333333318587393,2.8023826407295767,6.2499999985448085,0.14558746985811222,30.119792056211736,9.921328281220049,null,null,null,null,30.096536524069961,4.2576657297254004]
[null,null,null,null,null,null,null,null,null,null,null,null,null,null,null,null,null,20.208536063728388,10.061040246754805,null,null,null,null,null,null,null,null,null,null,6.4999999984866008,2.8310083916001689,6.41666666517267,0.17175450526354333,30.191834959259722,10.118093901764601,null,null,null,null,30.155813507735729,2.7640085121637918]
[null,null,null,null,null,null,null,null,null,null,null,null,null,null,null,null,null,20.344214436772745,10.271586190317612,null,null,null,null,null,null,null,null,null,null,6.6666666651144624,2.8634102511976356,6.5833333318005316,0.19441115763006486,30.304181580140721,10.340274881910533,null,null,null,null,30.248008269700222,1.7793627786950446]
[null,null,null,null,null,null,null,null,null,null,null,null,null,null,null,null,null,20.55962798622204,10.482261360601155,null,null,null,null,null,null,null,null,null,null,6.8333333317423239,2.8989343381982873,6.7499999984283932,0.21314452205353668,30.479027204273734,10.526514122683555,null,null,null,null,30.391604392207228,1.1461177696123737]
[null,null,null,null,null,null,null,null,null,null,null,null,null,null,null,null,null,20.902049214055296,10.693128606202979,null,null,null,null,null,null,null,null,null,null,6.9999999983701855,2.9369267712784337,6.9166666650562547,0.22795459853395345,30.749027973797638,10.716714065384119,null,null,null,null,30.614027589035686,0.74338347880284605]
[null,null,null,null,null,null,null,null,null,null,null,null,null,null,null,null,null,21.442285725788679,10.904263374595613,null,null,null,null,null,null,null,null,null,null,7.1666666649980471,2.9767336691143851,7.0833333316841163,0.23884138707131783,31.160632845421787,10.92176637821272,null,null,null,null,30.954830409609713,0.48815684222142552]
[null,null,null,null,null,null,null,null,null,null,null,null,null,null,null,null,null,22.281442677194718,11.115733453073027,null,null,null,null,null,null,null,null,null,null,7.3333333316259086,3.017701150382452,7.2499999983119778,0.24580488766563249,31.777109763061162,11.123641830880194,null,null,null,null,31.468871304241475,0.32612705996740926]
[null,null,null,null,null,null,null,null,null,null,null,null,null,null,null,null,null,23.553723619261291,11.327553158845967,null,null,null,null,null,null,null,null,null,null,7.4999999982537702,3.0591753337577772,7.4166666649398394,0.24884510030988971,32.681422297901008,11.335130838844925,null,null,null,null,32.229266030481085,0.22245835068030717]
[null,null,null,null,null,null,null,null,null,null,null,null,null,null,null,null,null,25.425947584153619,11.539624057245398,null,null,null,null,null,null,null,null,null,null,7.6666666648816317,3.1004910645350594,7.583333331567701,0.24789438472141082,33.983392054506112,11.515661543425173,null,null,null,null,33.33240717620356,0.15463067545868356]
[null,null,null,null,null,null,null,null,null,null,null,null,null,null,null,null,null,28.122492051625159,11.751718173325493,null,null,null,null,null,null,null,null,null,null,7.8333333315094933,3.1409387280845906,7.7499999981955625,0.24268598135369207,35.846407026110683,11.742123357553035,null,null,null,null,34.914899540308397,0.10819483825297374]
[null,null,null,null,null,null,null,null,null,null,null,null,null,null,null,null,null,32.065280988172162,11.963554366049292,null,null,null,null,null,null,null,null,null,null,7.9999999981373549,3.1797977509755357,7.9166666648234241,0.23315413739995614,38.567444209184032,11.919127186704428,null,null,null,null,37.206925617647357,7.4195618987429074E-2]
[null,null,null,null,null,null,null,null,null,null,null,null,null,null,null,null,null,38.31748273660196,12.174908797581793,null,null,null,null,null,null,null,null,null,null,8.1666666647652164,3.2163475597770579,8.0833333314512856,0.21929885286019235,42.780707859492395,12.134579030226917,null,null,null,null,40.674076034338214,4.7986305120812409E-2]
[null,null,null,null,null,null,null,null,null,null,null,null,null,null,null,null,null,49.999999998544808,12.385643935645515,null,null,null,null,null,null,null,null,null,null,8.333333331393078,3.2498675810583215,8.2499999980791472,0.20112012773440874,49.999999983992893,12.329984020184726,null,null,null,null,46.390353921742644,2.8018052784710534E-2]
[null,null,null,null,null,null,null,null,null,null,null,null,null,null,null,null,null,null,null,null,null,null,null,null,null,null,null,null,null,8.4999999980209395,3.2804008627074999,8.4166666647070087,0.18319968993772456]
[null,null,null,null,null,null,null,null,null,null,null,null,null,null,null,null,null,null,null,null,null,null,null,null,null,null,null,null,null,8.6666666646488011,3.3124809252457266,8.5833333313348703,0.19248037527417555]
[null,null,null,null,null,null,null,null,null,null,null,null,null,null,null,null,null,null,null,null,null,null,null,null,null,null,null,null,null,8.8333333312766626,3.352277322456616,8.7499999979627319,0.23877838332093165]
[null,null,null,null,null,null,null,null,null,null,null,null,null,null,null,null,null,null,null,null,null,null,null,null,null,null,null,null,null,8.9999999979045242,3.4060431229112895,8.9166666645905934,0.32259480280315095]
[null,null,null,null,null,null,null,null,null,null,null,null,null,null,null,null,null,null,null,null,null,null,null,null,null,null,null,null,null,9.1666666645323858,3.4832431786958851,9.083333331218455,0.4632003348154205]
[null,null,null,null,null,null,null,null,null,null,null,null,null,null,null,null,null,null,null,null,null,null,null,null,null,null,null,null,null,9.3333333311602473,3.5975473152111523,9.2499999978463165,0.68582481925128469]
[null,null,null,null,null,null,null,null,null,null,null,null,null,null,null,null,null,null,null,null,null,null,null,null,null,null,null,null,null,9.4999999977881089,3.7619031785552313,9.4166666644741781,0.98613518029407599]
[null,null,null,null,null,null,null,null,null,null,null,null,null,null,null,null,null,null,null,null,null,null,null,null,null,null,null,null,null,9.6666666644159704,3.9860998407033534,9.5833333311020397,1.3451799732019321]
[null,null,null,null,null,null,null,null,null,null,null,null,null,null,null,null,null,null,null,null,null,null,null,null,null,null,null,null,null,9.833333331043832,4.2765422357120855,9.7499999977299012,1.7426543704581356]
[null,null,null,null,null,null,null,null,null,null,null,null,null,null,null,null,null,null,null,null,null,null,null,null,null,null,null,null,null,9.9999999976716936,4.6218658784763447,9.9166666643577628,2.0719418570679666]
[null,null,null,null,null,null,null,null,null,null,null,null,null,null,null,null,null,null,null,null,null,null,null,null,null,null,null,null,null,10.166666664299555,4.9733973543699062,10.083333330985624,2.1091888558524525]
[null,null,null,null,null,null,null,null,null,null,null,null,null,null,null,null,null,null,null,null,null,null,null,null,null,null,null,null,null,10.333333330927417,5.274088692655063,10.249999997613486,1.8041480301310018]
[null,null,null,null,null,null,null,null,null,null,null,null,null,null,null,null,null,null,null,null,null,null,null,null,null,null,null,null,null,10.499999997555278,5.5123758769547591,10.416666664241347,1.4297231061310598]
[null,null,null,null,null,null,null,null,null,null,null,null,null,null,null,null,null,null,null,null,null,null,null,null,null,null,null,null,null,10.66666666418314,5.696164020174578,10.583333330869209,1.1027288595756628]
[null,null,null,null,null,null,null,null,null,null,null,null,null,null,null,null,null,null,null,null,null,null,null,null,null,null,null,null,null,10.833333330811001,5.8380728422574144,10.749999997497071,0.85145293269526268]
[null,null,null,null,null,null,null,null,null,null,null,null,null,null,null,null,null,null,null,null,null,null,null,null,null,null,null,null,null,10.999999997438863,5.9498495638201856,10.916666664124932,0.67066032953277743]
[null,null,null,null,null,null,null,null,null,null,null,null,null,null,null,null,null,null,null,null,null,null,null,null,null,null,null,null,null,11.166666664066724,6.0372804616567661,11.083333330752794,0.52458538714162273]
[null,null,null,null,null,null,null,null,null,null,null,null,null,null,null,null,null,null,null,null,null,null,null,null,null,null,null,null,null,11.333333330694586,6.1048762603425342,11.249999997380655,0.40557479220903847]
[null,null,null,null,null,null,null,null,null,null,null,null,null,null,null,null,null,null,null,null,null,null,null,null,null,null,null,null,null,11.499999997322448,6.1570834515621291,11.416666664008517,0.31324314739050224]
[null,null,null,null,null,null,null,null,null,null,null,null,null,null,null,null,null,null,null,null,null,null,null,null,null,null,null,null,null,11.666666663950309,6.1982479897027103,11.583333330636378,0.24698722890099331]
[null,null,null,null,null,null,null,null,null,null,null,null,null,null,null,null,null,null,null,null,null,null,null,null,null,null,null,null,null,11.833333330578171,6.2327070656575447,11.74999999726424,0.20675445577714541]
[null,null,null,null,null,null,null,null,null,null,null,null,null,null,null,null,null,null,null,null,null,null,null,null,null,null,null,null,null,11.999999997206032,6.2647796397064948,11.916666663892101,0.19243544433850507]
[null,null,null,null,null,null,null,null,null,null,null,null,null,null,null,null,null,null,null,null,null,null,null,null,null,null,null,null,null,12.166666663833894,6.2971576045572855,12.083333330519963,0.19426778914997567]
[null,null,null,null,null,null,null,null,null,null,null,null,null,null,null,null,null,null,null,null,null,null,null,null,null,null,null,null,null,12.333333330461755,6.3296443372348605,12.249999997147825,0.19492039611083387]
[null,null,null,null,null,null,null,null,null,null,null,null,null,null,null,null,null,null,null,null,null,null,null,null,null,null,null,null,null,12.499999997089617,6.3617463354633506,12.416666663775686,0.19261198941578611]
[null,null,null,null,null,null,null,null,null,null,null,null,null,null,null,null,null,null,null,null,null,null,null,null,null,null,null,null,null,12.666666663717479,6.3929700969668879,12.583333330403548,0.18734256906484312]
[null,null,null,null,null,null,null,null,null,null,null,null,null,null,null,null,null,null,null,null,null,null,null,null,null,null,null,null,null,12.83333333034534,6.422822119469604,12.749999997031409,0.17911213505799953]
[null,null,null,null,null,null,null,null,null,null,null,null,null,null,null,null,null,null,null,null,null,null,null,null,null,null,null,null,null,12.999999996973202,6.4508207235798842,12.916666663659271,0.16799162470079487]
[null,null,null,null,null,null,null,null,null,null,null,null,null,null,null,null,null,null,null,null,null,null,null,null,null,null,null,null,null,13.166666663601063,6.476838106389005,13.083333330287132,0.15610429689107069]
[null,null,null,null,null,null,null,null,null,null,null,null,null,null,null,null,null,null,null,null,null,null,null,null,null,null,null,null,null,13.333333330228925,6.5011529213246613,13.249999996914994,0.14588888964790483]
[null,null,null,null,null,null,null,null,null,null,null,null,null,null,null,null,null,null,null,null,null,null,null,null,null,null,null,null,null,13.499999996856786,6.5240662239709364,13.416666663542856,0.13747981590966019]
[null,null,null,null,null,null,null,null,null,null,null,null,null,null,null,null,null,null,null,null,null,null,null,null,null,null,null,null,null,13.666666663484648,6.5458790699119147,13.583333330170717,0.1308770756763421]
[null,null,null,null,null,null,null,null,null,null,null,null,null,null,null,null,null,null,null,null,null,null,null,null,null,null,null,null,null,13.833333330112509,6.5668925147316797,13.749999996798579,0.12608066894794526]
[null,null,null,null,null,null,null,null,null,null,null,null,null,null,null,null,null,null,null,null,null,null,null,null,null,null,null,null,null,13.999999996740371,6.5874076140143147,13.91666666342644,0.12309059572446965]
[null,null,null,null,null,null,null,null,null,null,null,null,null,null,null,null,null,null,null,null,null,null,null,null,null,null,null,null,null,14.166666663368233,6.6077254233439033,14.083333330054302,0.12190685600591525]
[null,null,null,null,null,null,null,null,null,null,null,null,null,null,null,null,null,null,null,null,null,null,null,null,null,null,null,null,null,14.333333329996094,6.6281425688228826,14.249999996682163,0.12250287290239771]
[null,null,null,null,null,null,null,null,null,null,null,null,null,null,null,null,null,null,null,null,null,null,null,null,null,null,null,null,null,14.499999996623956,6.6487816879526971,14.416666663310025,0.12383471480771971]
[null,null,null,null,null,null,null,null,null,null,null,null,null,null,null,null,null,null,null,null,null,null,null,null,null,null,null,null,null,14.666666663251817,6.6695383583953864,14.583333329937886,0.12454002268513291]
[null,null,null,null,null,null,null,null,null,null,null,null,null,null,null,null,null,null,null,null,null,null,null,null,null,null,null,null,null,14.833333329879679,6.6902928777001245,14.749999996565748,0.12452711585742196]
[null,null,null,null,null,null,null,null,null,null,null,null,null,null,null,null,null,null,null,null,null,null,null,null,null,null,null,null,null,14.99999999650754,6.7109255434160824,14.91666666319361,0.12379599432457089]
[null,null,null,null,null,null,null,null,null,null,null,null,null,null,null,null,null,null,null,null,null,null,null,null,null,null,null,null,null,15.166666663135402,6.7313166530924313,15.083333329821471,0.12234665808657968]
[null,null,null,null,null,null,null,null,null,null,null,null,null,null,null,null,null,null,null,null,null,null,null,null,null,null,null,null,null,15.333333329763263,6.7513465042783443,15.249999996449333,0.12017910714345902]
[null,null,null,null,null,null,null,null,null,null,null,null,null,null,null,null,null,null,null,null,null,null,null,null,null,null,null,null,null,15.499999996391125,6.7708953945229915,15.416666663077194,0.11729334149519288]
[null,null,null,null,null,null,null,null,null,null,null,null,null,null,null,null,null,null,null,null,null,null,null,null,null,null,null,null,null,15.666666663018987,6.789843621375546,15.583333329705056,0.11368936114179727]
[null,null,null,null,null,null,null,null,null,null,null,null,null,null,null,null,null,null,null,null,null,null,null,null,null,null,null,null,null,15.833333329646848,6.8080714823851789,15.749999996332917,0.10936716608326154]
[null,null,null,null,null,null,null,null,null,null,null,null,null,null,null,null,null,null,null,null,null,null,null,null,null,null,null,null,null,15.99999999627471,6.8254592751010623,15.916666662960779,0.104326756319591]
[null,null,null,null,null,null,null,null,null,null,null,null,null,null,null,null,null,null,null,null,null,null,null,null,null,null,null,null,null,16.166666662902571,6.8419202134055812,16.08333332958864,9.8765629850109005E-2]
[null,null,null,null,null,null,null,null,null,null,null,null,null,null,null,null,null,null,null,null,null,null,null,null,null,null,null,null,null,16.333333329530433,6.857515631350739,16.249999996216502,9.3572507692733592E-2]
[null,null,null,null,null,null,null,null,null,null,null,null,null,null,null,null,null,null,null,null,null,null,null,null,null,null,null,null,null,16.499999996158294,6.8723485081909006,16.416666662844364,8.8997261061690563E-2]
[null,null,null,null,null,null,null,null,null,null,null,null,null,null,null,null,null,null,null,null,null,null,null,null,null,null,null,null,null,16.666666662786156,6.8865218254192184,16.583333329472225,8.5039903389706864E-2]
[null,null,null,null,null,null,null,null,null,null,null,null,null,null,null,null,null,null,null,null,null,null,null,null,null,null,null,null,null,16.833333329414017,6.9001385645288478,16.749999996100087,8.1700434676798467E-2]
[null,null,null,null,null,null,null,null,null,null,null,null,null,null,null,null,null,null,null,null,null,null,null,null,null,null,null,null,null,16.999999996041879,6.9133017070129412,16.916666662727948,7.8978854922949385E-2]
[null,null,null,null,null,null,null,null,null,null,null,null,null,null,null,null,null,null,null,null,null,null,null,null,null,null,null,null,null,17.166666662669741,6.9261142343646531,17.08333332935581,7.687516412817029E-2]
[null,null,null,null,null,null,null,null,null,null,null,null,null,null,null,null,null,null,null,null,null,null,null,null,null,null,null,null,null,17.333333329297602,6.9386791280771378,17.249999995983671,7.5389362292461182E-2]
[null,null,null,null,null,null,null,null,null,null,null,null,null,null,null,null,null,null,null,null,null,null,null,null,null,null,null,null,null,17.499999995925464,6.951099369643547,17.416666662611533,7.4521449415806046E-2]
[null,null,null,null,null,null,null,null,null,null,null,null,null,null,null,null,null,null,null,null,null,null,null,null,null,null,null,null,null,17.666666662553325,6.9634779405570368,17.583333329239395,7.4271425498231569E-2]
[null,null,null,null,null,null,null,null,null,null,null,null,null,null,null,null,null,null,null,null,null,null,null,null,null,null,null,null,null,17.833333329181187,6.975917822310759,17.749999995867256,7.4639290539711065E-2]
[null,null,null,null,null,null,null,null,null,null,null,null,null,null,null,null,null,null,null,null,null,null,null,null,null,null,null,null,null,17.999999995809048,6.9885219963978686,17.916666662495118,7.562504454026589E-2]
[null,null,null,null,null,null,null,null,null,null,null,null,null,null,null,null,null,null,null,null,null,null,null,null,null,null,null,null,null,18.16666666243691,7.0013927652130876,18.083333329122979,7.7224612909294138E-2]
[null,null,null,null,null,null,null,null,null,null,null,null,null,null,null,null,null,null,null,null,null,null,null,null,null,null,null,null,null,18.333333329064772,7.0146132290692345,18.249999995750841,7.9322783155349783E-2]
[null,null,null,null,null,null,null,null,null,null,null,null,null,null,null,null,null,null,null,null,null,null,null,null,null,null,null,null,null,18.499999995692633,7.0282450557569831,18.416666662378702,8.1790960145535344E-2]
[null,null,null,null,null,null,null,null,null,null,null,null,null,null,null,null,null,null,null,null,null,null,null,null,null,null,null,null,null,18.666666662320495,7.0423487861911473,18.583333329006564,8.4622382624688131E-2]
[null,null,null,null,null,null,null,null,null,null,null,null,null,null,null,null,null,null,null,null,null,null,null,null,null,null,null,null,null,18.833333328948356,7.056984961286541,18.749999995634425,8.7817050592808171E-2]
[null,null,null,null,null,null,null,null,null,null,null,null,null,null,null,null,null,null,null,null,null,null,null,null,null,null,null,null,null,18.999999995576218,7.0722141219579777,18.916666662262287,9.1374964049895452E-2]
[null,null,null,null,null,null,null,null,null,null,null,null,null,null,null,null,null,null,null,null,null,null,null,null,null,null,null,null,null,19.166666662204079,7.0880968091202732,19.083333328890149,9.529612299596063E-2]
[null,null,null,null,null,null,null,null,null,null,null,null,null,null,null,null,null,null,null,null,null,null,null,null,null,null,null,null,null,19.333333328831941,7.1046935636882402,19.24999999551801,9.958052743098772E-2]
[null,null,null,null,null,null,null,null,null,null,null,null,null,null,null,null,null,null,null,null,null,null,null,null,null,null,null,null,null,19.499999995459802,7.1220649265766935,19.416666662145872,0.10422817735498739]
[null,null,null,null,null,null,null,null,null,null,null,null,null,null,null,null,null,null,null,null,null,null,null,null,null,null,null,null,null,19.666666662087664,7.1402714387004478,19.583333328773733,0.10923907276795963]
[null,null,null,null,null,null,null,null,null,null,null,null,null,null,null,null,null,null,null,null,null,null,null,null,null,null,null,null,null,19.833333328715526,7.1593736409743158,19.749999995401595,0.11461321366989378]
[null,null,null,null,null,null,null,null,null,null,null,null,null,null,null,null,null,null,null,null,null,null,null,null,null,null,null,null,null,19.999999995343387,7.1794320743131133,19.916666662029456,0.12035060006080583]
[null,null,null,null,null,null,null,null,null,null,null,null,null,null,null,null,null,null,null,null,null,null,null,null,null,null,null,null,null,20.166666661971249,7.2005072796316529,20.083333328657318,0.12645123194067981]
[null,null,null,null,null,null,null,null,null,null,null,null,null,null,null,null,null,null,null,null,null,null,null,null,null,null,null,null,null,20.33333332859911,7.2226597978447495,20.249999995285179,0.13291510930952635]
[null,null,null,null,null,null,null,null,null,null,null,null,null,null,null,null,null,null,null,null,null,null,null,null,null,null,null,null,null,20.499999995226972,7.2459197901198928,20.416666661913041,0.13955995368335367]
[null,null,null,null,null,null,null,null,null,null,null,null,null,null,null,null,null,null,null,null,null,null,null,null,null,null,null,null,null,20.666666661854833,7.2701132206289074,20.583333328540903,0.14516058308788524]
[null,null,null,null,null,null,null,null,null,null,null,null,null,null,null,null,null,null,null,null,null,null,null,null,null,null,null,null,null,20.833333328482695,7.294981922185408,20.749999995168764,0.14921220937374455]
[null,null,null,null,null,null,null,null,null,null,null,null,null,null,null,null,null,null,null,null,null,null,null,null,null,null,null,null,null,20.999999995110556,7.3202674656887918,20.916666661796626,0.15171326105562663]
[null,null,null,null,null,null,null,null,null,null,null,null,null,null,null,null,null,null,null,null,null,null,null,null,null,null,null,null,null,21.166666661738418,7.3457114220384572,21.083333328424487,0.15266373813353684]
[null,null,null,null,null,null,null,null,null,null,null,null,null,null,null,null,null,null,null,null,null,null,null,null,null,null,null,null,null,21.33333332836628,7.3710553621338013,21.249999995052349,0.15206364060746985]
[null,null,null,null,null,null,null,null,null,null,null,null,null,null,null,null,null,null,null,null,null,null,null,null,null,null,null,null,null,21.499999994994141,7.3960408568742224,21.41666666168021,0.14991296847743099]
[null,null,null,null,null,null,null,null,null,null,null,null,null,null,null,null,null,null,null,null,null,null,null,null,null,null,null,null,null,21.666666661622003,7.4204094771591178,21.583333328308072,0.14621172174341493]
[null,null,null,null,null,null,null,null,null,null,null,null,null,null,null,null,null,null,null,null,null,null,null,null,null,null,null,null,null,21.833333328249864,7.4439027938878866,21.749999994935934,0.1409599004054323]
[null,null,null,null,null,null,null,null,null,null,null,null,null,null,null,null,null,null,null,null,null,null,null,null,null,null,null,null,null,21.999999994877726,7.4662623779599251,21.916666661563795,0.13415750446346716]
[null,null,null,null,null,null,null,null,null,null,null,null,null,null,null,null,null,null,null,null,null,null,null,null,null,null,null,null,null,22.166666661505587,7.4872298002746325,22.083333328191657,0.12580453391753546]
[null,null,null,null,null,null,null,null,null,null,null,null,null,null,null,null,null,null,null,null,null,null,null,null,null,null,null,null,null,22.333333328133449,7.506546631731406,22.249999994819518,0.11590098876762656]
[null,null,null,null,null,null,null,null,null,null,null,null,null,null,null,null,null,null,null,null,null,null,null,null,null,null,null,null,null,22.499999994761311,7.523954443229643,22.41666666144738,0.10444686901374045]
[null,null,null,null,null,null,null,null,null,null,null,null,null,null,null,null,null,null,null,null,null,null,null,null,null,null,null,null,null,22.666666661389172,7.539201837129232,22.583333328075241,9.1484363418834105E-2]
[null,null,null,null,null,null,null,null,null,null,null,null,null,null,null,null,null,null,null,null,null,null,null,null,null,null,null,null,null,22.833333328017034,7.55227799991897,22.749999994703103,7.845697675669519E-2]
[null,null,null,null,null,null,null,null,null,null,null,null,null,null,null,null,null,null,null,null,null,null,null,null,null,null,null,null,null,22.999999994644895,7.5634669110258397,22.916666661330964,6.7133466656848953E-2]
[null,null,null,null,null,null,null,null,null,null,null,null,null,null,null,null,null,null,null,null,null,null,null,null,null,null,null,null,null,23.166666661272757,7.5730705636278817,23.083333327958826,5.762191562566809E-2]
[null,null,null,null,null,null,null,null,null,null,null,null,null,null,null,null,null,null,null,null,null,null,null,null,null,null,null,null,null,23.333333327900618,7.5813909509031348,23.249999994586688,4.9922323663141942E-2]
[null,null,null,null,null,null,null,null,null,null,null,null,null,null,null,null,null,null,null,null,null,null,null,null,null,null,null,null,null,23.49999999452848,7.5887300660296377,23.416666661214549,4.4034690769270517E-2]
[null,null,null,null,null,null,null,null,null,null,null,null,null,null,null,null,null,null,null,null,null,null,null,null,null,null,null,null,null,23.666666661156341,7.5953899021854312,23.583333327842411,3.9959016944064465E-2]
[null,null,null,null,null,null,null,null,null,null,null,null,null,null,null,null,null,null,null,null,null,null,null,null,null,null,null,null,null,23.833333327784203,7.6016724525485548,23.749999994470272,3.7695302187518459E-2]
[null,null,null,null,null,null,null,null,null,null,null,null,null,null,null,null,null,null,null,null,null,null,null,null,null,null,null,null,null,23.999999994412065,7.6078797102970466,23.916666661098134,3.7243546499621846E-2]
[null,null,null,null,null,null,null,null,null,null,null,null,null,null,null,null,null,null,null,null,null,null,null,null,null,null,null,null,null,24.166666661039926,7.614313668608947,24.083333327725995,3.8603749880390607E-2]
[null,null,null,null,null,null,null,null,null,null,null,null,null,null,null,null,null,null,null,null,null,null,null,null,null,null,null,null,null,24.333333327667788,7.6212763206622958,24.249999994353857,4.1775912329819413E-2]
[null,null,null,null,null,null,null,null,null,null,null,null,null,null,null,null,null,null,null,null,null,null,null,null,null,null,null,null,null,24.499999994295649,7.6290696596351308,24.416666660981718,4.6760033847897606E-2]
[null,null,null,null,null,null,null,null,null,null,null,null,null,null,null,null,null,null,null,null,null,null,null,null,null,null,null,null,null,24.666666660923511,7.6379895352961489,24.58333332760958,5.3519253978569159E-2]
[null,null,null,null,null,null,null,null,null,null,null,null,null,null,null,null,null,null,null,null,null,null,null,null,null,null,null,null,null,24.833333327551372,7.6481888277728354,24.749999994237442,6.1195754874367216E-2]
[null,null,null,null,null,null,null,null,null,null,null,null,null,null,null,null,null,null,null,null,null,null,null,null,null,null,null,null,null,24.999999994179234,7.659676512882414,24.916666660865303,6.8926110673520002E-2]
[null,null,null,null,null,null,null,null,null,null,null,null,null,null,null,null,null,null,null,null,null,null,null,null,null,null,null,null,null,25.166666660807095,7.6724552360964653,25.083333327493165,7.6672339302159276E-2]
[null,null,null,null,null,null,null,null,null,null,null,null,null,null,null,null,null,null,null,null,null,null,null,null,null,null,null,null,null,25.333333327434957,7.6865276428865679,25.249999994121026,8.4434440760274385E-2]
[null,null,null,null,null,null,null,null,null,null,null,null,null,null,null,null,null,null,null,null,null,null,null,null,null,null,null,null,null,25.499999994062819,7.7018963787243022,25.416666660748888,9.2212415047875973E-2]
[null,null,null,null,null,null,null,null,null,null,null,null,null,null,null,null,null,null,null,null,null,null,null,null,null,null,null,null,null,25.66666666069068,7.718564089081247,25.583333327376749,0.10000626216495338]
[null,null,null,null,null,null,null,null,null,null,null,null,null,null,null,null,null,null,null,null,null,null,null,null,null,null,null,null,null,25.833333327318542,7.7365334194289819,25.749999994004611,0.10781598211151194]
[null,null,null,null,null,null,null,null,null,null,null,null,null,null,null,null,null,null,null,null,null,null,null,null,null,null,null,null,null,25.999999993946403,7.7558070152390863,25.916666660632472,0.11564157488755167]
[null,null,null,null,null,null,null,null,null,null,null,null,null,null,null,null,null,null,null,null,null,null,null,null,null,null,null,null,null,26.166666660574265,7.7763875219831409,26.083333327260334,0.12348304049307787]
[null,null,null,null,null,null,null,null,null,null,null,null,null,null,null,null,null,null,null,null,null,null,null,null,null,null,null,null,null,26.333333327202126,7.7983104182679028,26.249999993888196,0.13153737773919769]
[null,null,null,null,null,null,null,null,null,null,null,null,null,null,null,null,null,null,null,null,null,null,null,null,null,null,null,null,null,26.499999993829988,7.8218489731365857,26.416666660516057,0.14123132924498]
[null,null,null,null,null,null,null,null,null,null,null,null,null,null,null,null,null,null,null,null,null,null,null,null,null,null,null,null,null,26.66666666045785,7.8473811589054732,26.583333327143919,0.15319311464899302]
[null,null,null,null,null,null,null,null,null,null,null,null,null,null,null,null,null,null,null,null,null,null,null,null,null,null,null,null,null,26.833333327085711,7.8752854028956136,26.74999999377178,0.16742546397982458]
[null,null,null,null,null,null,null,null,null,null,null,null,null,null,null,null,null,null,null,null,null,null,null,null,null,null,null,null,null,26.999999993713573,7.9059401324280536,26.916666660399642,0.183928377237464]
[null,null,null,null,null,null,null,null,null,null,null,null,null,null,null,null,null,null,null,null,null,null,null,null,null,null,null,null,null,27.166666660341434,7.9397237748238414,27.083333327027503,0.20270185442192196]
[null,null,null,null,null,null,null,null,null,null,null,null,null,null,null,null,null,null,null,null,null,null,null,null,null,null,null,null,null,27.333333326969296,7.9770147574040253,27.249999993655365,0.22374589553319849]
[null,null,null,null,null,null,null,null,null,null,null,null,null,null,null,null,null,null,null,null,null,null,null,null,null,null,null,null,null,27.499999993597157,8.0181497687394803,27.416666660283227,0.24681006807019459]
[null,null,null,null,null,null,null,null,null,null,null,null,null,null,null,null,null,null,null,null,null,null,null,null,null,null,null,null,null,27.666666660225019,8.0624626468656846,27.583333326911088,0.26587726881913032]
[null,null,null,null,null,null,null,null,null,null,null,null,null,null,null,null,null,null,null,null,null,null,null,null,null,null,null,null,null,27.83333332685288,8.1082599743605925,27.74999999353895,0.27478396503342578]
[null,null,null,null,null,null,null,null,null,null,null,null,null,null,null,null,null,null,null,null,null,null,null,null,null,null,null,null,null,27.999999993480742,8.1538017131829577,27.916666660166811,0.27325043299781177]
[null,null,null,null,null,null,null,null,null,null,null,null,null,null,null,null,null,null,null,null,null,null,null,null,null,null,null,null,null,28.166666660108604,8.1973478252915335,28.083333326794673,0.26127667271228827]
[null,null,null,null,null,null,null,null,null,null,null,null,null,null,null,null,null,null,null,null,null,null,null,null,null,null,null,null,null,28.333333326736465,8.2371849707225984,28.249999993422534,0.23902287264204106]
[null,null,null,null,null,null,null,null,null,null,null,null,null,null,null,null,null,null,null,null,null,null,null,null,null,null,null,null,null,28.499999993364327,8.2742897354577316,28.416666660050396,0.22262858846263422]
[null,null,null,null,null,null,null,null,null,null,null,null,null,null,null,null,null,null,null,null,null,null,null,null,null,null,null,null,null,28.666666659992188,8.3145948465981938,28.583333326678257,0.24183066689907881]
[null,null,null,null,null,null,null,null,null,null,null,null,null,null,null,null,null,null,null,null,null,null,null,null,null,null,null,null,null,28.83333332662005,8.3645667463664939,28.749999993306119,0.29983139867961039]
[null,null,null,null,null,null,null,null,null,null,null,null,null,null,null,null,null,null,null,null,null,null,null,null,null,null,null,null,null,28.999999993247911,8.4308476701342894,28.916666659933981,0.39768554269936629]
[null,null,null,null,null,null,null,null,null,null,null,null,null,null,null,null,null,null,null,null,null,null,null,null,null,null,null,null,null,29.166666659875773,8.5219762542628761,29.083333326561842,0.54677150489882542]
[null,null,null,null,null,null,null,null,null,null,null,null,null,null,null,null,null,null,null,null,null,null,null,null,null,null,null,null,null,29.333333326503634,8.6476618945417716,29.249999993189704,0.7541138418489538]
[null,null,null,null,null,null,null,null,null,null,null,null,null,null,null,null,null,null,null,null,null,null,null,null,null,null,null,null,null,29.499999993131496,8.8187477371889926,29.416666659817565,1.0265150561223304]
[null,null,null,null,null,null,null,null,null,null,null,null,null,null,null,null,null,null,null,null,null,null,null,null,null,null,null,null,null,29.666666659759358,9.0473107506911941,29.583333326445427,1.3713780813325074]
[null,null,null,null,null,null,null,null,null,null,null,null,null,null,null,null,null,null,null,null,null,null,null,null,null,null,null,null,null,29.833333326387219,9.338591324521337,29.749999993073288,1.7476834433877719]
[null,null,null,null,null,null,null,null,null,null,null,null,null,null,null,null,null,null,null,null,null,null,null,null,null,null,null,null,null,29.999999993015081,9.6847646515526851,29.91666665970115,2.0770399626716869]
[null,null,null,null,null,null,null,null,null,null,null,null,null,null,null,null,null,null,null,null,null,null,null,null,null,null,null,null,null,30.166666659642942,10.038390915891167,30.083333326329011,2.1217575865249021]
[null,null,null,null,null,null,null,null,null,null,null,null,null,null,null,null,null,null,null,null,null,null,null,null,null,null,null,null,null,30.333333326270804,10.340797306677638,30.249999992956873,1.8144383451412838]
[null,null,null,null,null,null,null,null,null,null,null,null,null,null,null,null,null,null,null,null,null,null,null,null,null,null,null,null,null,30.499999992898665,10.576680501517522,30.416666659584735,1.4152991693688295]
[null,null,null,null,null,null,null,null,null,null,null,null,null,null,null,null,null,null,null,null,null,null,null,null,null,null,null,null,null,30.666666659526527,10.755009188187802,30.583333326212596,1.0699721202708037]
[null,null,null,null,null,null,null,null,null,null,null,null,null,null,null,null,null,null,null,null,null,null,null,null,null,null,null,null,null,30.833333326154388,10.887550402214305,30.749999992840458,0.7952472843441758]
[null,null,null,null,null,null,null,null,null,null,null,null,null,null,null,null,null,null,null,null,null,null,null,null,null,null,null,null,null,30.99999999278225,10.984210113763577,30.916666659468319,0.57995826943066275]
[null,null,null,null,null,null,null,null,null,null,null,null,null,null,null,null,null,null,null,null,null,null,null,null,null,null,null,null,null,31.166666659410112,11.053542805482726,31.083333326096181,0.41599615041174942]
[null,null,null,null,null,null,null,null,null,null,null,null,null,null,null,null,null,null,null,null,null,null,null,null,null,null,null,null,null,31.333333326037973,11.103024543946196,31.249999992724042,0.29689043084994543]
[null,null,null,null,null,null,null,null,null,null,null,null,null,null,null,null,null,null,null,null,null,null,null,null,null,null,null,null,null,31.499999992665835,11.140019260525239,31.416666659351904,0.22196829952594013]
[null,null,null,null,null,null,null,null,null,null,null,null,null,null,null,null,null,null,null,null,null,null,null,null,null,null,null,null,null,31.666666659293696,11.169397435236068,31.583333325979766,0.17626904830601109]
[null,null,null,null,null,null,null,null,null,null,null,null,null,null,null,null,null,null,null,null,null,null,null,null,null,null,null,null,null,31.833333325921558,11.193099640306832,31.749999992607627,0.14221323045769582]
[null,null,null,null,null,null,null,null,null,null,null,null,null,null,null,null,null,null,null,null,null,null,null,null,null,null,null,null,null,31.999999992549419,11.212898903746616,31.916666659235489,0.11879558066636657]
[null,null,null,null,null,null,null,null,null,null,null,null,null,null,null,null,null,null,null,null,null,null,null,null,null,null,null,null,null,32.166666659177281,11.230568253564504,32.08333332586335,0.10601609893201268]
[null,null,null,null,null,null,null,null,null,null,null,null,null,null,null,null,null,null,null,null,null,null,null,null,null,null,null,null,null,32.333333325805143,11.247830798171762,32.249999992491212,0.10357526766766124]
[null,null,null,null,null,null,null,null,null,null,null,null,null,null,null,null,null,null,null,null,null,null,null,null,null,null,null,null,null,32.499999992433004,11.265551994634237,32.416666659119073,0.10632717879960388]
[null,null,null,null,null,null,null,null,null,null,null,null,null,null,null,null,null,null,null,null,null,null,null,null,null,null,null,null,null,32.666666659060866,11.283875440100541,32.583333325746935,0.10994067282342382]
[null,null,null,null,null,null,null,null,null,null,null,null,null,null,null,null,null,null,null,null,null,null,null,null,null,null,null,null,null,32.833333325688727,11.302922223596045,32.749999992374796,0.11428070099963428]
[null,null,null,null,null,null,null,null,null,null,null,null,null,null,null,null,null,null,null,null,null,null,null,null,null,null,null,null,null,32.999999992316589,11.322813434146116,32.916666659002658,0.11934726332821392]
[null,null,null,null,null,null,null,null,null,null,null,null,null,null,null,null,null,null,null,null,null,null,null,null,null,null,null,null,null,33.16666665894445,11.343670160776123,33.08333332563052,0.1251403598091734]
[null,null,null,null,null,null,null,null,null,null,null,null,null,null,null,null,null,null,null,null,null,null,null,null,null,null,null,null,null,33.333333325572312,11.36561349251143,33.249999992258381,0.1316599904425021]
[null,null,null,null,null,null,null,null,null,null,null,null,null,null,null,null,null,null,null,null,null,null,null,null,null,null,null,null,null,33.499999992200173,11.388764516026701,33.416666658886243,0.13890614112396218]
[null,null,null,null,null,null,null,null,null,null,null,null,null,null,null,null,null,null,null,null,null,null,null,null,null,null,null,null,null,33.666666658828035,11.413166803339232,33.583333325514104,0.14641372390927773]
[null,null,null,null,null,null,null,null,null,null,null,null,null,null,null,null,null,null,null,null,null,null,null,null,null,null,null,null,null,33.833333325455897,11.438582375551933,33.749999992141966,0.15249343331171095]
[null,null,null,null,null,null,null,null,null,null,null,null,null,null,null,null,null,null,null,null,null,null,null,null,null,null,null,null,null,33.999999992083758,11.464709348599028,33.916666658769827,0.15676183831906892]
[null,null,null,null,null,null,null,null,null,null,null,null,null,null,null,null,null,null,null,null,null,null,null,null,null,null,null,null,null,34.16666665871162,11.491245838414743,34.083333325397689,0.15921893893136232]
[null,null,null,null,null,null,null,null,null,null,null,null,null,null,null,null,null,null,null,null,null,null,null,null,null,null,null,null,null,34.333333325339481,11.517889960933305,34.24999999202555,0.1598647351485912]
[null,null,null,null,null,null,null,null,null,null,null,null,null,null,null,null,null,null,null,null,null,null,null,null,null,null,null,null,null,34.499999991967343,11.544339832088935,34.416666658653412,0.15869922697073419]
[null,null,null,null,null,null,null,null,null,null,null,null,null,null,null,null,null,null,null,null,null,null,null,null,null,null,null,null,null,34.666666658595204,11.570293567815863,34.583333325281274,0.15572241439782325]
[null,null,null,null,null,null,null,null,null,null,null,null,null,null,null,null,null,null,null,null,null,null,null,null,null,null,null,null,null,34.833333325223066,11.595449284048309,34.749999991909135,0.15093429742981582]
[null,null,null,null,null,null,null,null,null,null,null,null,null,null,null,null,null,null,null,null,null,null,null,null,null,null,null,null,null,34.999999991850927,11.619505096720502,34.916666658536997,0.14433487606676512]
[null,null,null,null,null,null,null,null,null,null,null,null,null,null,null,null,null,null,null,null,null,null,null,null,null,null,null,null,null,35.166666658478789,11.642159121766667,35.083333325164858,0.13592415030863919]
[null,null,null,null,null,null,null,null,null,null,null,null,null,null,null,null,null,null,null,null,null,null,null,null,null,null,null,null,null,35.333333325106651,11.663109475121027,35.24999999179272,0.12570212015542742]
[null,null,null,null,null,null,null,null,null,null,null,null,null,null,null,null,null,null,null,null,null,null,null,null,null,null,null,null,null,35.499999991734512,11.682061912493909,35.416666658420581,0.11371462426376554]
[null,null,null,null,null,null,null,null,null,null,null,null,null,null,null,null,null,null,null,null,null,null,null,null,null,null,null,null,null,35.666666658362374,11.69892900616933,35.583333325048443,0.10120256207608737]
[null,null,null,null,null,null,null,null,null,null,null,null,null,null,null,null,null,null,null,null,null,null,null,null,null,null,null,null,null,35.833333324990235,11.713849058547815,35.749999991676304,8.9520314291756636E-2]
[null,null,null,null,null,null,null,null,null,null,null,null,null,null,null,null,null,null,null,null,null,null,null,null,null,null,null,null,null,35.999999991618097,11.726971803597303,35.916666658304166,7.8736470315260029E-2]
[null,null,null,null,null,null,null,null,null,null,null,null,null,null,null,null,null,null,null,null,null,null,null,null,null,null,null,null,null,36.166666658245958,11.738446975285733,36.083333324932028,6.8851030146608219E-2]
[null,null,null,null,null,null,null,null,null,null,null,null,null,null,null,null,null,null,null,null,null,null,null,null,null,null,null,null,null,36.33333332487382,11.748424307581047,36.249999991559889,5.9863993785822509E-2]
[null,null,null,null,null,null,null,null,null,null,null,null,null,null,null,null,null,null,null,null,null,null,null,null,null,null,null,null,null,36.499999991501682,11.757053534451183,36.416666658187751,5.1775361232870944E-2]
[null,null,null,null,null,null,null,null,null,null,null,null,null,null,null,null,null,null,null,null,null,null,null,null,null,null,null,null,null,36.666666658129543,11.764484389864082,36.583333324815612,4.4585132487774827E-2]
[null,null,null,null,null,null,null,null,null,null,null,null,null,null,null,null,null,null,null,null,null,null,null,null,null,null,null,null,null,36.833333324757405,11.770866607787683,36.749999991443474,3.82933075505235E-2]
[null,null,null,null,null,null,null,null,null,null,null,null,null,null,null,null,null,null,null,null,null,null,null,null,null,null,null,null,null,36.999999991385266,11.776349922189926,36.916666658071335,3.2899886421116971E-2]
[null,null,null,null,null,null,null,null,null,null,null,null,null,null,null,null,null,null,null,null,null,null,null,null,null,null,null,null,null,37.166666658013128,11.781084067038751,37.083333324699197,2.840486909956589E-2]
[null,null,null,null,null,null,null,null,null,null,null,null,null,null,null,null,null,null,null,null,null,null,null,null,null,null,null,null,null,37.333333324640989,11.785218776302097,37.249999991327059,2.4808255585848947E-2]
[null,null,null,null,null,null,null,null,null,null,null,null,null,null,null,null,null,null,null,null,null,null,null,null,null,null,null,null,null,37.499999991268851,11.788903783947905,37.41666665795492,2.2110045879998111E-2]
[null,null,null,null,null,null,null,null,null,null,null,null,null,null,null,null,null,null,null,null,null,null,null,null,null,null,null,null,null,37.666666657896712,11.792288823944114,37.583333324582782,2.031023998198141E-2]
[null,null,null,null,null,null,null,null,null,null,null,null,null,null,null,null,null,null,null,null,null,null,null,null,null,null,null,null,null,37.833333324524574,11.795523630258664,37.749999991210643,1.9408837891820161E-2]
[null,null,null,null,null,null,null,null,null,null,null,null,null,null,null,null,null,null,null,null,null,null,null,null,null,null,null,null,null,37.999999991152436,11.798757936859493,37.916666657838505,1.9405839609493047E-2]
[null,null,null,null,null,null,null,null,null,null,null,null,null,null,null,null,null,null,null,null,null,null,null,null,null,null,null,null,null,38.166666657780297,11.802141477714544,38.083333324466366,2.030124513503204E-2]
[null,null,null,null,null,null,null,null,null,null,null,null,null,null,null,null,null,null,null,null,null,null,null,null,null,null,null,null,null,38.333333324408159,11.805823986791754,38.249999991094228,2.2095054468405172E-2]
[null,null,null,null,null,null,null,null,null,null,null,null,null,null,null,null,null,null,null,null,null,null,null,null,null,null,null,null,null,38.49999999103602,11.809939883932138,38.416666657722089,2.4695382848052946E-2]
[null,null,null,null,null,null,null,null,null,null,null,null,null,null,null,null,null,null,null,null,null,null,null,null,null,null,null,null,null,38.666666657663882,11.814513091636998,38.583333324349951,2.7439246235549528E-2]
[null,null,null,null,null,null,null,null,null,null,null,null,null,null,null,null,null,null,null,null,null,null,null,null,null,null,null,null,null,38.833333324291743,11.81951903813491,38.749999990977813,3.003567899446373E-2]
[null,null,null,null,null,null,null,null,null,null,null,null,null,null,null,null,null,null,null,null,null,null,null,null,null,null,null,null,null,38.999999990919605,11.824932944152732,38.916666657605674,3.2483436114492413E-2]
[null,null,null,null,null,null,null,null,null,null,null,null,null,null,null,null,null,null,null,null,null,null,null,null,null,null,null,null,null,39.166666657547466,11.830730030417318,39.083333324233536,3.4782517595614265E-2]
[null,null,null,null,null,null,null,null,null,null,null,null,null,null,null,null,null,null,null,null,null,null,null,null,null,null,null,null,null,39.333333324175328,11.836885517655526,39.249999990861397,3.6932923437850589E-2]
[null,null,null,null,null,null,null,null,null,null,null,null,null,null,null,null,null,null,null,null,null,null,null,null,null,null,null,null,null,39.49999999080319,11.843374626594212,39.416666657489259,3.8934653641180081E-2]
[null,null,null,null,null,null,null,null,null,null,null,null,null,null,null,null,null,null,null,null,null,null,null,null,null,null,null,null,null,39.666666657431051,11.85017257796023,39.58333332411712,4.0787708205602735E-2]
[null,null,null,null,null,null,null,null,null,null,null,null,null,null,null,null,null,null,null,null,null,null,null,null,null,null,null,null,null,39.833333324058913,11.857254592480436,39.749999990744982,4.2492087131129216E-2]
[null,null,null,null,null,null,null,null,null,null,null,null,null,null,null,null,null,null,null,null,null,null,null,null,null,null,null,null,null,39.999999990686774,11.864595890881688,39.916666657372843,4.4047790417770176E-2]
[null,null,null,null,null,null,null,null,null,null,null,null,null,null,null,null,null,null,null,null,null,null,null,null,null,null,null,null,null,40.166666657314636,11.87217169389084,40.083333324000705,4.5454818065493639E-2]
[null,null,null,null,null,null,null,null,null,null,null,null,null,null,null,null,null,null,null,null,null,null,null,null,null,null,null,null,null,40.333333323942497,11.879957222234749,40.249999990628567,4.6713170074331581E-2]
[null,null,null,null,null,null,null,null,null,null,null,null,null,null,null,null,null,null,null,null,null,null,null,null,null,null,null,null,null,40.499999990570359,11.887927696640272,40.416666657256428,4.7822846444273343E-2]
[null,null,null,null,null,null,null,null,null,null,null,null,null,null,null,null,null,null,null,null,null,null,null,null,null,null,null,null,null,40.66666665719822,11.896058337834262,40.58333332388429,4.8783847175297615E-2]
[null,null,null,null,null,null,null,null,null,null,null,null,null,null,null,null,null,null,null,null,null,null,null,null,null,null,null,null,null,40.833333323826082,11.904324366543577,40.749999990512151,4.9596172267436366E-2]
[null,null,null,null,null,null,null,null,null,null,null,null,null,null,null,null,null,null,null,null,null,null,null,null,null,null,null,null,null,40.999999990453944,11.912701003495073,40.916666657140013,5.0259821720678943E-2]
[null,null,null,null,null,null,null,null,null,null,null,null,null,null,null,null,null,null,null,null,null,null,null,null,null,null,null,null,null,41.166666657081805,11.921163469415605,41.083333323767874,5.0774795535014676E-2]
[null,null,null,null,null,null,null,null,null,null,null,null,null,null,null,null,null,null,null,null,null,null,null,null,null,null,null,null,null,41.333333323709667,11.929686985032028,41.249999990395736,5.1141093710443578E-2]
[null,null,null,null,null,null,null,null,null,null,null,null,null,null,null,null,null,null,null,null,null,null,null,null,null,null,null,null,null,41.499999990337528,11.938246771071201,41.416666657023598,5.1358716246997622E-2]
[null,null,null,null,null,null,null,null,null,null,null,null,null,null,null,null,null,null,null,null,null,null,null,null,null,null,null,null,null,41.66666665696539,11.946818048259978,41.583333323651459,5.1427663144634164E-2]
[null,null,null,null,null,null,null,null,null,null,null,null,null,null,null,null,null,null,null,null,null,null,null,null,null,null,null,null,null,41.833333323593251,11.955376037325214,41.749999990279321,5.1347934403374533E-2]
[null,null,null,null,null,null,null,null,null,null,null,null,null,null,null,null,null,null,null,null,null,null,null,null,null,null,null,null,null,41.999999990221113,11.963895958993765,41.916666656907182,5.1119530023208064E-2]
[null,null,null,null,null,null,null,null,null,null,null,null,null,null,null,null,null,null,null,null,null,null,null,null,null,null,null,null,null,42.166666656848975,11.972353033992491,42.083333323535044,5.0742450004166731E-2]
[null,null,null,null,null,null,null,null,null,null,null,null,null,null,null,null,null,null,null,null,null,null,null,null,null,null,null,null,null,42.333333323476836,11.980722483048243,42.249999990162905,5.0216694346207909E-2]
[null,null,null,null,null,null,null,null,null,null,null,null,null,null,null,null,null,null,null,null,null,null,null,null,null,null,null,null,null,42.499999990104698,11.98897952688788,42.416666656790767,4.95422630493529E-2]
[null,null,null,null,null,null,null,null,null,null,null,null,null,null,null,null,null,null,null,null,null,null,null,null,null,null,null,null,null,42.666666656732559,11.997099386238254,42.583333323418628,4.8719156113591067E-2]
[null,null,null,null,null,null,null,null,null,null,null,null,null,null,null,null,null,null,null,null,null,null,null,null,null,null,null,null,null,42.833333323360421,12.005057281826225,42.74999999004649,4.7747373538943705E-2]
[null,null,null,null,null,null,null,null,null,null,null,null,null,null,null,null,null,null,null,null,null,null,null,null,null,null,null,null,null,42.999999989988282,12.012830373399117,42.916666656674352,4.6638549448209346E-2]
[null,null,null,null,null,null,null,null,null,null,null,null,null,null,null,null,null,null,null,null,null,null,null,null,null,null,null,null,null,43.166666656616144,12.020413570476409,43.083333323302213,4.549918247434389E-2]
[null,null,null,null,null,null,null,null,null,null,null,null,null,null,null,null,null,null,null,null,null,null,null,null,null,null,null,null,null,43.333333323244005,12.027811305613364,43.249999989930075,4.4386410832064301E-2]
[null,null,null,null,null,null,null,null,null,null,null,null,null,null,null,null,null,null,null,null,null,null,null,null,null,null,null,null,null,43.499999989871867,12.035028102271939,43.416666656557936,4.3300779961533066E-2]
[null,null,null,null,null,null,null,null,null,null,null,null,null,null,null,null,null,null,null,null,null,null,null,null,null,null,null,null,null,43.666666656499729,12.042068483914088,43.583333323185798,4.2242289862728877E-2]
[null,null,null,null,null,null,null,null,null,null,null,null,null,null,null,null,null,null,null,null,null,null,null,null,null,null,null,null,null,43.83333332312759,12.048936974001762,43.749999989813659,4.1210940535641075E-2]
[null,null,null,null,null,null,null,null,null,null,null,null,null,null,null,null,null,null,null,null,null,null,null,null,null,null,null,null,null,43.999999989755452,12.055638095996921,43.916666656441521,4.0206731980312285E-2]
[null,null,null,null,null,null,null,null,null,null,null,null,null,null,null,null,null,null,null,null,null,null,null,null,null,null,null,null,null,44.166666656383313,12.062176373361517,44.083333323069382,3.9229664196710541E-2]
[null,null,null,null,null,null,null,null,null,null,null,null,null,null,null,null,null,null,null,null,null,null,null,null,null,null,null,null,null,44.333333323011175,12.068556329557502,44.249999989697244,3.8279737184825184E-2]
[null,null,null,null,null,null,null,null,null,null,null,null,null,null,null,null,null,null,null,null,null,null,null,null,null,null,null,null,null,44.499999989639036,12.074782488046836,44.416666656325106,3.735695094469884E-2]
[null,null,null,null,null,null,null,null,null,null,null,null,null,null,null,null,null,null,null,null,null,null,null,null,null,null,null,null,null,44.666666656266898,12.080859372291469,44.583333322952967,3.6461305476288883E-2]
[null,null,null,null,null,null,null,null,null,null,null,null,null,null,null,null,null,null,null,null,null,null,null,null,null,null,null,null,null,44.833333322894759,12.086791505753359,44.749999989580829,3.5592800779627287E-2]
[null,null,null,null,null,null,null,null,null,null,null,null,null,null,null,null,null,null,null,null,null,null,null,null,null,null,null,null,null,44.999999989522621,12.092583411894459,44.91666665620869,3.4751436854692737E-2]
[null,null,null,null,null,null,null,null,null,null,null,null,null,null,null,null,null,null,null,null,null,null,null,null,null,null,null,null,null,45.166666656150483,12.098239614176723,45.083333322836552,3.3937213701485225E-2]
[null,null,null,null,null,null,null,null,null,null,null,null,null,null,null,null,null,null,null,null,null,null,null,null,null,null,null,null,null,45.333333322778344,12.103764636062106,45.249999989464413,3.3150131320015416E-2]
[null,null,null,null,null,null,null,null,null,null,null,null,null,null,null,null,null,null,null,null,null,null,null,null,null,null,null,null,null,45.499999989406206,12.109163001012563,45.416666656092275,3.2390189710283304E-2]
[null,null,null,null,null,null,null,null,null,null,null,null,null,null,null,null,null,null,null,null,null,null,null,null,null,null,null,null,null,45.666666656034067,12.114439232490048,45.583333322720136,3.1657388872278244E-2]
[null,null,null,null,null,null,null,null,null,null,null,null,null,null,null,null,null,null,null,null,null,null,null,null,null,null,null,null,null,45.833333322661929,12.119597853956517,45.749999989347998,3.0951728806021536E-2]
[null,null,null,null,null,null,null,null,null,null,null,null,null,null,null,null,null,null,null,null,null,null,null,null,null,null,null,null,null,45.99999998928979,12.124643388873922,45.91666665597586,3.0273209511481217E-2]
[null,null,null,null,null,null,null,null,null,null,null,null,null,null,null,null,null,null,null,null,null,null,null,null,null,null,null,null,null,46.166666655917652,12.129580360704221,46.083333322603721,2.9621830988689254E-2]
[null,null,null,null,null,null,null,null,null,null,null,null,null,null,null,null,null,null,null,null,null,null,null,null,null,null,null,null,null,46.333333322545514,12.134413292909365,46.249999989231583,2.8997593237613681E-2]
[null,null,null,null,null,null,null,null,null,null,null,null,null,null,null,null,null,null,null,null,null,null,null,null,null,null,null,null,null,46.499999989173375,12.139146708951312,46.416666655859444,2.8400496258297121E-2]
[null,null,null,null,null,null,null,null,null,null,null,null,null,null,null,null,null,null,null,null,null,null,null,null,null,null,null,null,null,46.666666655801237,12.143785132292013,46.583333322487306,2.7830540050686289E-2]
[null,null,null,null,null,null,null,null,null,null,null,null,null,null,null,null,null,null,null,null,null,null,null,null,null,null,null,null,null,46.833333322429098,12.148333086393427,46.749999989115167,2.7287724614834474E-2]
[null,null,null,null,null,null,null,null,null,null,null,null,null,null,null,null,null,null,null,null,null,null,null,null,null,null,null,null,null,46.99999998905696,12.152795094717504,46.916666655743029,2.6772049950699046E-2]
[null,null,null,null,null,null,null,null,null,null,null,null,null,null,null,null,null,null,null,null,null,null,null,null,null,null,null,null,null,47.166666655684821,12.157175680726203,47.083333322370891,2.6283516058311977E-2]
[null,null,null,null,null,null,null,null,null,null,null,null,null,null,null,null,null,null,null,null,null,null,null,null,null,null,null,null,null,47.333333322312683,12.161479367881475,47.249999988998752,2.582212293764129E-2]
[null,null,null,null,null,null,null,null,null,null,null,null,null,null,null,null,null,null,null,null,null,null,null,null,null,null,null,null,null,47.499999988940544,12.165710679645276,47.416666655626614,2.5387870588718966E-2]
[null,null,null,null,null,null,null,null,null,null,null,null,null,null,null,null,null,null,null,null,null,null,null,null,null,null,null,null,null,47.666666655568406,12.16987413947956,47.583333322254475,2.4980759011523683E-2]
[null,null,null,null,null,null,null,null,null,null,null,null,null,null,null,null,null,null,null,null,null,null,null,null,null,null,null,null,null,47.833333322196268,12.173974270846283,47.749999988882337,2.4600788206066104E-2]
[null,null,null,null,null,null,null,null,null,null,null,null,null,null,null,null,null,null,null,null,null,null,null,null,null,null,null,null,null,47.999999988824129,12.1780155972074,47.916666655510198,2.4247958172346224E-2]
[null,null,null,null,null,null,null,null,null,null,null,null,null,null,null,null,null,null,null,null,null,null,null,null,null,null,null,null,null,48.166666655451991,12.182002642024862,48.08333332213806,2.3922268910342728E-2]
[null,null,null,null,null,null,null,null,null,null,null,null,null,null,null,null,null,null,null,null,null,null,null,null,null,null,null,null,null,48.333333322079852,12.185939928760627,48.249999988765921,2.3623720420087594E-2]
[null,null,null,null,null,null,null,null,null,null,null,null,null,null,null,null,null,null,null,null,null,null,null,null,null,null,null,null,null,48.499999988707714,12.189831980876649,48.416666655393783,2.335231270157016E-2]
[null,null,null,null,null,null,null,null,null,null,null,null,null,null,null,null,null,null,null,null,null,null,null,null,null,null,null,null,null,48.666666655335575,12.193683321834882,48.583333322021645,2.3108045754779771E-2]
[null,null,null,null,null,null,null,null,null,null,null,null,null,null,null,null,null,null,null,null,null,null,null,null,null,null,null,null,null,48.833333321963437,12.19749847509728,48.749999988649506,2.2890919579716423E-2]
[null,null,null,null,null,null,null,null,null,null,null,null,null,null,null,null,null,null,null,null,null,null,null,null,null,null,null,null,null,48.999999988591298,12.201281964125799,48.916666655277368,2.2700934176401434E-2]
[null,null,null,null,null,null,null,null,null,null,null,null,null,null,null,null,null,null,null,null,null,null,null,null,null,null,null,null,null,49.16666665521916,12.205038312382392,49.083333321905229,2.2538089544802832E-2]
[null,null,null,null,null,null,null,null,null,null,null,null,null,null,null,null,null,null,null,null,null,null,null,null,null,null,null,null,null,49.333333321847022,12.208772043329017,49.249999988533091,2.2402385684963246E-2]
[null,null,null,null,null,null,null,null,null,null,null,null,null,null,null,null,null,null,null,null,null,null,null,null,null,null,null,null,null,49.499999988474883,12.212487680427623,49.416666655160952,2.2293822596829386E-2]
[null,null,null,null,null,null,null,null,null,null,null,null,null,null,null,null,null,null,null,null,null,null,null,null,null,null,null,null,null,49.666666655102745,12.21618974714017,49.583333321788814,2.2212400280454545E-2]
[null,null,null,null,null,null,null,null,null,null,null,null,null,null,null,null,null,null,null,null,null,null,null,null,null,null,null,null,null,49.833333321730606,12.21988276692861,49.749999988416675,2.2158118735796088E-2]
[null,null,null,null,null,null,null,null,null,null,null,null,null,null,null,null,null,null,null,null,null,null,null,null,null,null,null,null,null,49.999999988358468,12.223571263254897,49.916666655044537,2.2130977962875335E-2]

{"sheet":"Constantes","index":11,"n_rows":302,"n_cols":27,"rows_kept":302,"cut":false,"hidden":false,"merged":[]}
[null,"           "," Base de Dados","de Constantes de Dissociação de Ácidos / Protonação de Bases"]
[]
[null,"Valores de pKa de ~250 ácidos e bases comuns, na temperatura e força iônica indicadas nas coluna K e L, via de regra, 25 ºC e 0 mol/L (ou seja, valores de pKa0, presumidos nos cálculos do CurTiPot) "]
[null,"Não se dá garantia de que os pKas compilados ou os cálculos efetuados com CurTiPot sejam corretos ou exatos. CurTiPot considera somente os equilíbrios de protonação em água, ignorando outros equilíbrios e reações químicas, inclusive entre dois ou mais sistemas ácido-base, quando presentes simultaneamente."]
[null,"Adições podem ser feitas no final ou em qualquer ponto mediante inserção novas linhas e renumerando sequencialmente a coluna B (de 1 a 280) "]
[null,"Compilações de Constantes e breve bibliografia sobre equilíbrios ácido-base "]
[null,"Mini-SCDatabase - constantes de estabilidade (equilíbrio) com correção de efeito de temperatura e força iônica",null,null,null,null,null,"http://www.acadsoft.co.uk/scdbase/scdbase.htm",null,null,null,null,null,"Tutorial sobre ácidos e bases (e outros equilíbrios), em inglês",null,null,null,null,null,"http://www.asdlib.org/onlineArticles/ecourseware/Text_Files_files/Chapter6.pdf"]
[null,"Dissociation constants of  inorganic and organic compounds (compliation with 33 pages)",null,null,null,null,null,"https://www.chem.wisc.edu/areas/reich/pkatable/pKa_compilation-1-Williams.pdf",null,null,null,null,null,"Tutorial sobre titulação de ácidos e bases (em inglês)",null,null,null,null,null,"http://www.asdlib.org/onlineArticles/ecourseware/Text_Files_files/Chapter9.pdf"]
[null,"Dissociation constants of organic compounds (~600 compounds)",null,null,null,null,null,"http://www.zirchrom.com/organic.htm",null,null,null,null,null,"Measurement of pH. Definitions, Standards and Procedures (IUPAC - 2002) ",null,null,null,null,null,"http://www.iupac.org/publications/pac/2002/pdf/7411x2169.pdf"]
[null,"Computer calculated pKa values of any compound (accepts chemical name, CAS #, SMILES) ",null,null,null,null,null,"http://www.chemicalize.org/",null,null,null,null,null,"Temperature dependence of potassium hydrogen phtalate 0.05 mol/kg buffer",null,null,null,null,null,"http://nvl.nist.gov/pub/nistpubs/jres/081/1/V81.N01.A03.pdf"]
[null,"Martell, A. E., Smith, R. M., Critical Stability Constants, Vol. 1–4. Plenum Press: New York, 1976.",null,null,null,null,null,null,null,null,null,null,null,"Primiary standard buffer solutions pH at various temperatures",null,null,null,null,null,"http://nvl.nist.gov/pub/nistpubs/jres/066/2/V66.N02.A06.pdf"]
[null,"Perrin, D. D., Dissociation Constants of Organic Bases in Aqueous Solution, Butterworths, London, 1965; Supplement, 1972.",null,null,null,null,null,null,null,null,null,null,null,"Water,  hydrogen ion, hydroxide ion structures, properties, Kw, pH ",null,null,null,null,null,"http://www1.lsbu.ac.uk/water/hydrogen_ions.html"]
[null,"Serjeant, E. P., and Dempsey, B., Ionization Constants of Organic Acids in Aqueous Solution, Pergamon, Oxford, 1979.",null,null,null,null,null,null,null,null,null,null,null,"Buffer Reference Center",null,null,"https://www.sigmaaldrich.com/life-science/core-bioreagents/biological-buffers/learning-center/buffer-reference-center.html"]
[null,"Albert, A., \"Ionization Constants of Heterocyclic Substances\", in Physical Methods in Heterocyclic Chemistry, Katritzky, A. R., Ed., Academic Press, New York, 1963. ",null,null,null,null,null,null,null,null,null,null,null,"Online Buffer Calculator",null,null,"http://www.sigmaaldrich.com/life-science/core-bioreagents/biological-buffers/learning-center/buffer-calculator.html"]
[null,"Perrin, D. D., Dempsey, B., and Serjeant, E. P., pKa Prediction for Organic Acids and Bases, Chapman & Hall, London, 1981.",null,null,null,null,null,null,null,null,null,null,null,"Biological Buffers (with temperature dependence calculator)",null,null,null,null,null,"http://www.reachdevices.com/Protein/BiologicalBuffers.html"]
[null,"Dawson, R. M. C., Elliot, D. C., Elliot, W. H., and Jones, K. M., Data for Biochemical Research, Oxford Science Publications, Oxford, 1986.",null,null,null,null,null,null,null,null,null,null,"Conversão de constantes de dissociação em constantes de protonação das bases conjugadas"]
[null,"Indicadores ácido-base - pKas, transições de cor, etc.",null,null,null,null,null,null,null,null,null,null,"pKa1 = logKpn","pKa4 = logKpn-3",null,"Constantes cumulativas (globais) de protonação"]
[null,"Estimativas de coeficientes de atividade, gi, no CurTiPot - equação de Davies:",null,null,null,null,null,null,"Força iônica =",null,null,null,"pKa2 = logKpn-1","pKa5 = logKpn-4",null,"logbp,i = logSKp and bp,i = PKp"]
[null,null,null,null,null,null,null,null,null,null,null,null,"pKa3 = logKpn-2","pKa6 = logKpn-5"]
[null,null,"Ácido ou Base","Carga, inteiramente",null,null,"pKa = -log da constante de dissociação do ácido",null,null,null,"Temperat.","Força",null,"Massa molar"]
[null,null,null,"desprotonado","pKa1","pKa2","pKa3","pKa4","pKa5","pKa6","ºC","iônica","  Formula","g/mol"]
[null,null,"U S O   F R E Q Ü E N T E"]
[null,1,"Ácido acético",-1,4.7569999999999997,null,null,null,null,null,25,0,"CH3COOH",60.052]
[null,2,"Ácido carbônico",-2,6.3520000000000003,10.329000000000001,null,null,null,null,25,0,"H2CO3"]
[null,3,"Ácido cítrico",-3,3.1280000000000001,4.7610000000000001,6.3959999999999999,null,null,null,25,0,"H3C6H5O7 ",192.02699999999999]
[null,4,"Ácido clorídrico",-1,-7,null,null,null,null,null,25,0]
[null,5,"Ácido EDTA",-4,-0.21,1.5,2.21,3.11,6.75,11.03,25,0,"C10H16N2O8",292.08999999999997]
[null,6,"Ácido fosfórico",-3,2.1480000000000001,7.1989999999999998,12.35,null,null,null,25,0,"H3PO4",97.975999999999999]
[null,7,"Hidróxido de amônio",0,9.2439999999999998,null,null,null,null,null,25,0,"NH3",17.026]
[null,8,"Hidróxido de sódio",-1,13.997,null,null,null,null,null,25,0,"NaOH"]
[null,9]
[null,10]
[null,11,"O R D E M   A L F A B É T I C A"]
[null,12,"Acetamida ",0,0.63,null,null,null,null,null,25,0,"C2H5NO ",59.067]
[null,13,"Ácido acético",-1,4.7569999999999997,null,null,null,null,null,25,0,"CH3COOH",60.052]
[null,14,"Ácido acetoacético ",-1,3.58,null,null,null,null,null,18,0,"C4H6O3 ",102.089]
[null,15,"Ácido acrílico ",-1,4.25,null,null,null,null,null,25,0,"C3H4O2 ",72.063000000000002]
[null,16,"Ácido adípico ",-2,4.43,5.41,null,null,null,null,25,0,"C6H10O4 ",146.143]
[null,17,"Ácido 4-aminobenzóico",-1,2.5009999999999999,4.8739999999999997,null,null,null,null,25,0,"C7H7NO2 ",137.13800000000001]
[null,18,"Ácido 2-aminobenzóico",-1,2.1080000000000001,4.9459999999999997,null,null,null,null,25,0,"C7H7NO2 ",137.13800000000001]
[null,19,"Ácido 2-aminobutanóico",-1,2.29,9.83,null,null,null,null,25,0,"C4H9NO2 ",103.12]
[null,20,"Ácido 6-aminohexanóico",-1,4.3730000000000002,10.804,null,null,null,null,25,0,"C6H13NO2 ",131.17400000000001]
[null,21,"Ácido 5-aminopentanóico",-1,4.2699999999999996,10.766,null,null,null,null,25,0,"C5H11NO2 ",117.14700000000001]
[null,22,"Ácido arsênico",-3,2.2400000000000002,6.96,11.5,null,null,null,25,0,"H3AsO4 "]
[null,23,"Ácido arsenoso",-1,9.2200000000000006,null,null,null,null,null,null,0,"H3AsO3 "]
[null,24,"Ácido ascórbico",-2,4.0999999999999996,11.79,null,null,null,null,24,0,"C6H8O6 "]
[null,25,"Ácido aspártico",-2,1.99,3.9,10.002000000000001,null,null,null,25,0,"C4H7NO4 "]
[null,26,"Ácido barbitúrico ",-1,4.01,null,null,null,null,null,25,0,"C4H4N2O3 ",128.09]
[null,27,"Ácido benzenosulfônico ",-1,0.7,null,null,null,null,null,25,0,"C6H6O3S "]
[null,28,"Ácido benzóico ",-1,4.1900000000000004,null,null,null,null,null,25,0,"C7H6O2 "]
[null,29,"Ácido bórico",-3,9.2360000000000007,12.74,13.8,null,null,null,20,0,"H3BO3"]
[null,30,"Ácido bromídrico",-1,-9,null,null,null,null,null,25,0,"HI"]
[null,31,"Ácido butanóico ",-1,4.83,null,null,null,null,null,25,0,"C4H8O2 "]
[null,32,"Ácido 3-butenóico",-1,4.34,null,null,null,null,null,25,0,"C4H6O2 "]
[null,33,"Ácido carbônico",-2,6.3520000000000003,10.329000000000001,null,null,null,null,25,0,"H2CO3"]
[null,34,"Ácido cianídrico",-1,9.2100000000000009,null,null,null,null,null,25,0,"HCN"]
[null,35,"Ácido ciânico",-1,3.46,null,null,null,null,null,null,null,"HCNO "]
[null,36,"Ácido cítrico",-3,3.1280000000000001,4.7610000000000001,6.3959999999999999,null,null,null,25,0,"H3C6H5O7 "]
[null,37,"Ácido clorídrico",-1,-7,null,null,null,null,null,25,0,"HCl"]
[null,38,"Ácido cloroacético",-1,2.8650000000000002,null,null,null,null,null,25,0,"ClCH2COOH"]
[null,39,"Ácido 2-clorobenzóico",-1,2.92,null,null,null,null,null,25,0,"C7H5CIO2 "]
[null,40,"Ácido 3-clorobenzóico",-1,3.82,null,null,null,null,null,25,0,"C7H5CIO2 "]
[null,41,"Ácido 4-clorobenzóico",-1,3.98,null,null,null,null,null,25,0,"C7H5CIO2 "]
[null,42,"Ácido crômico",-2," –0,2",6.51,null,null,null,null,20,0,"H2CrO4"]
[null,43,"Ácido 2,4-diaminobutanóico",-1,1.85,8.24,10.44,null,null,null,25,0,"C4H10N2O2 "]
[null,44,"Ácido dicloroacético",-1,1.3,null,null,null,null,null,25,0,"Cl2CHCOOH"]
[null,45,"Ácido dínicotínico",-1,2.8,null,null,null,null,null,25,0,"C7H5NO4 "]
[null,46,"Ácido dipicolínico ",-2,2.16,4.76,null,null,null,null,25,0,"C7H5NO4 "]
[null,47,"Ácido etilenodiaminatetraacético (EDTA)",-4,-0.21,1.5,2.21,3.11,6.75,11.03,25,0,"C10H16N2O8"]
[null,48,"Ácido fenilacético ",-1,4.28,null,null,null,null,null,18,0,"C8H8O2 "]
[null,49,"Ácido fluorídrico",-1,3.17,null,null,null,null,null,25,0,"HF"]
[null,50,"ácido fórmico",-1,3.7450000000000001,null,null,null,null,null,20,0,"HCOOH"]
[null,51,"Ácido fosfórico",-3,2.1480000000000001,7.1989999999999998,12.35,null,null,null,25,0,"H3PO4"]
[null,52,"Ácido m-ftálico",-2,3.7,4.5999999999999996,null,null,null,null,25,0,"C8H6O4 ",166.14]
[null,53,"Ácido o-ftálico",-2,2.76,4.96,null,null,null,null,25,0,"C8H6O4 "]
[null,54,"Ácido p-ftálico",-2,3.54,4.46,null,null,null,null,25,0,"C8H6O4 ",166.14]
[null,55,"ácido fumárico",-2,3.0529999999999999,4.4939999999999998,null,null,null,null,25,0,"C4H4O4 ",116.07]
[null,56,"Ácido glicérico ",-1,3.52,null,null,null,null,null,25,0,"C3H6O4 "]
[null,57,"Ácido glicólico",-1,3.831,null,null,null,null,null,25,0,"HOCH2COOH"]
[null,58,"Ácido glioxílico",-1,3.18,null,null,null,null,null,25,0,"C2H2O3 "]
[null,59,"Ácido l-glutâmico",-2,2.23,4.42,9.9499999999999993,null,null,null,25,0,"C5H9NO4 ",147.13]
[null,60,"Ácido heptanodióico ",-1,4.71,null,null,null,null,null,25,0,"C7H12O4 "]
[null,61,"Ácido heptanóico",-1,4.8899999999999997,null,null,null,null,null,25,0,"C7H14O2 "]
[null,62,"Ácido hexanóico ",-1,4.8499999999999996,null,null,null,null,null,25,0,"C6H12O2 "]
[null,63,"Ácido hidrazóico ",-1,4.72,null,null,null,null,null,null,null,"HN3 "]
[null,64,"Ácido m-hidroxibenzóico",-2,4.0599999999999996,9.92,null,null,null,null,19,0,"C7H6O3 "]
[null,65,"Ácido p-hidroxibenzóico",-2,4.4800000000000004,9.32,null,null,null,null,19,0,"C7H6O3 "]
[null,66,"Ácido 3-hidroxipropanóico",-1,4.51,null,null,null,null,null,25,0,"C3H6O3 "]
[null,67,"Ácido hipobromoso",-1,8.6300000000000008,null,null,null,null,null,25,0,"HOBr"]
[null,68,"Ácido hipocloroso",-1,7.53,null,null,null,null,null,25,0,"HOCl"]
[null,69,"Ácido hipoiodoso",-1,10.64,null,null,null,null,null,25,0,"HOI"]
[null,70,"Ácido iódico",-1,0.77,null,null,null,null,null,25,0,"HIO3"]
[null,71,"Ácido isocítrico",-3,3.29,4.71,6.4,null,null,null,25,0,"C6H8O7 "]
[null,72,"Ácido lático",-1,3.86,null,null,null,null,null,null,null,"HC3H5O3 "]
[null,73,"Ácido maleico",-2,1.91,6.3319999999999999,null,null,null,null,25,0,"C4H4O4 "]
[null,74,"Ácido málico ",-2,3.4590000000000001,5.0970000000000004,null,null,null,null,25,0,"C4H6O5 "]
[null,75,"Ácido malônico",-2,2.847,5.6959999999999997,null,null,null,null,25,0,"HOOCCH2COOH"]
[null,76,"Ácido 2-metilbutanóico",-1,4.8,null,null,null,null,null,25,0,"C5H10O2 "]
[null,77,"Ácido 3-metilbutanóico",-1,4.7699999999999996,null,null,null,null,null,25,0,"C5H10O2 "]
[null,78,"Ácido metilmalônico ",-2,3.07,5.76,null,null,null,null,25,0,"C4H6O4 "]
[null,79,"Ácido 4-metilpentanóico",-1,4.84,null,null,null,null,null,18,0,"C6H12O2 "]
[null,80,"ácido 2-(N-morfolino)ethanosulfonico = MES",-1,6.2,null,null,null,null,null,25,0,"C6H13NO4S ",195.2]
[null,81,"Ácido nitrilotriacético",-3,1.1000000000000001,1.65,2.94,10.334,null,null,20,0,"C6H9NO6",191.11]
[null,82,"Ácido 2-nitrobenzóico",-1,2.1789999999999998,null,null,null,null,null,25,0,"C7H5NO4 "]
[null,83,"Ácido 3-nitrobenzóico",-1,3.4489999999999998,null,null,null,null,null,25,0,"C7H5NO4 "]
[null,84,"Ácido 4-nitrobenzóico",-1,3.4420000000000002,null,null,null,null,null,25,0,"C7H5NO4 "]
[null,85,"Ácido nitroso",-1,3.15,null,null,null,null,null,25,0,"HNO2"]
[null,86,"Ácido octanóico ",-1,4.8899999999999997,null,null,null,null,null,25,0,"C8H16O2 "]
[null,87,"Ácido octenodióico",-1,4.5199999999999996,null,null,null,null,null,25,0,"C8H14O4 "]
[null,88,"Ácido oxálico",-2,1.252,4.266,null,null,null,null,25,0,"C2H2O4 "]
[null,89,"Ácido oxaloacético ",-2,2.2200000000000002,3.89,13.03,null,null,null,25,0,"C4H4O5 "]
[null,90,"Ácido pentanóico ",-1,4.84,null,null,null,null,null,25,0,"C5H10O2 "]
[null,91,"Ácido perclórico",-1,-10,null,null,null,null,null,25,0,"HClO4"]
[null,92,"Ácido p-periódico",-2,1.55,8.2799999999999994,null,null,null,null,null,null,"H5IO6 "]
[null,93,"Ácido picolínico ",-2,1.07,5.25,null,null,null,null,25,0,"C6H5NO2 "]
[null,94,"Ácido pícrico ",-1,0.38,null,null,null,null,null,null,null,"C6H3N3O7 "]
[null,95,"Ácido 3-piridinocarboxílico",-1,4.96,null,null,null,null,null,25,0,"C6H5NO2 "]
[null,96,"Ácido 4-piridinocarboxílico",-1,4.8499999999999996,null,null,null,null,null,25,0,"C6H5NO2 "]
[null,97,"Ácido pirofosfórico ",-4,1.52,2.36,6.6,9.25,null,null,null,null,"H4P2O7 ",177.98]
[null,98,"Ácido pirúvico",-1,2.39,null,null,null,null,null,25,0,"C3H4O3 ",88.06]
[null,99,"Ácido propanóico",-1,4.8739999999999997,null,null,null,null,null,25,0,"CH3CH2COOH"]
[null,100,"Ácido salicílico",-2,2.97,13.74,null,null,null,null,25,0,"C7H6O3 ",138.12]
[null,101,"Ácido selênico",-1,1.92,null,null,null,null,null,25,0,"H2SeO4"]
[null,102,"Ácido selenoso",-2,2.64,8.2799999999999994,null,null,null,null,null,0,"H2SeO3 "]
[null,103,"Ácido m-silícico",-2,9.6999999999999993,12,null,null,null,null,null,null,"H2SiO3"]
[null,104,"Ácido o-silícico",-2,9.66,11.7,null,null,null,null,null,null,"H4SiO4"]
[null,105,"Ácido sórbico",-1,4.76,null,null,null,null,null,null,null,"C6H8O2",112.13]
[null,106,"Ácido succínico",-2,4.2069999999999999,5.6360000000000001,null,null,null,null,null,null,"HOOCCH2CH2COOH",118.09]
[null,107,"Ácido sulfâmico",-1,0.995,null,null,null,null,null,null,null,"H3NSO3",97.09]
[null,108,"Ácido sulfídrico",-2,7.02,13.9,null,null,null,null,25,0,"H2S"]
[null,109,"Ácido sulfúrico",-2,-3,1.99,null,null,null,null,25,0,"H2SO4 ",98.08]
[null,110,"Ácido sulfuroso ",-2,1.91,7.18,null,null,null,null,25,0,"H2SO3",82.07]
[null,111,"Ácido meso-tartárico",-2,3.22,4.82,null,null,null,null,25,0,"C4H6O6 ",150.09]
[null,112,"Ácido d-tartárico",-2,3.036,4.3659999999999997,null,null,null,null,25,0,"C4H6O6 ",150.09]
[null,113,"Ácido tereftálico ",-1,3.51,null,null,null,null,null,25,0,"C8H6O4 "]
[null,114,"Ácido tioacético ",-1,3.33,null,null,null,null,null,25,0,"C2H4OS "]
[null,115,"Ácido tiociânico",-1,0.9,null,null,null,null,null,25,0,"HSCN"]
[null,116,"Ácido tiossulfúrico",-2,0.6,1.63,null,null,null,null,25,0,"H2S2O3"]
[null,117,"Ácido m-tolúico",-1,4.2699999999999996,null,null,null,null,null,25,0,"C8H8O2 "]
[null,118,"Ácido o-tolúico",-1,3.91,null,null,null,null,null,25,0,"C8H8O2 "]
[null,119,"Ácido p-tolúico",-1,4.3600000000000003,null,null,null,null,null,25,0,"C8H8O2 "]
[null,120,"Ácido tricloroacético",-1,0.87,null,null,null,null,null,25,0,"Cl3CCOOH"]
[null,121,"Ácido trimetilacético ",-1,5.03,null,null,null,null,null,25,0,"C5H10O2 "]
[null,122,"Ácido úrico ",-1,3.89,null,null,null,null,null,12,0,"C5H4N4O3 "]
[null,123,"Alanina ",-1,2.3479999999999999,9.8670000000000009,null,null,null,null,25,0,"C3H7NO2",89.093999999999994]
[null,124,"b-Alanina",-1,3.55,10.24,null,null,null,null,25,0,"C3H7NO2 "]
[null,125,"Aminobenzeno = anilina",0,4.5999999999999996,null,null,null,null,null,25,0,"C6H7N",93.13]
[null,126,"2-Aminofenol",-1,4.78,9.9700000000000006,null,null,null,null,20,0,"C6H7NO"]
[null,127,"Amonia",0,9.2439999999999998,null,null,null,null,null,25,0,"NH3",17.026]
[null,128,"Anilina",0,4.63,null,null,null,null,null,25,0,"C6H7N "]
[null,129,"Arginina",-1,1.823,8.9909999999999997,12.48,null,null,null,25,0,"C6H14N4O2 "]
[null,130,"Asparagina",-1,2.14,8.93,null,null,null,null,25,0,"C4H8N2O3 "]
[null,131,"Barbital",0,7.43,null,null,null,null,null,25,0,"C8H12N2O3 ",184.19]
[null,132,"Benzilamina",0,9.33,null,null,null,null,null,25,0,"C7H9N "]
[null,133,"2-Benzilpiridina",0,5.13,null,null,null,null,null,25,0,"C12H11N "]
[null,134,"Betaína ",-1,1.83,null,null,null,null,null,0,0,"C5H11NO2 "]
[null,135,"Butilamina",0,10.77,null,null,null,null,null,20,0,"C4H11N "]
[null,136,"sec-Butilamina",0,10.56,null,null,null,null,null,25,0,"C4H11N "]
[null,137,"terc-Butilamina",0,10.68,null,null,null,null,null,25,0,"C4H11N "]
[null,138,"Cadaverina ",0,10.050000000000001,10.93,null,null,null,null,25,0,"C5H14N2 "]
[null,139,"Catecol",-2,9.4,12.8,null,null,null,null,25,0,"C6H4(OH)2",110.1]
[null,140,"Cisteína ",-2,1.71,8.36,10.77,null,null,null,25,0,"C3H7NO2S "]
[null,141,"2-Cloroanilina ",0,2.65,null,null,null,null,null,25,0,"C6H6CIN "]
[null,142,"3-Cloroanilina",0,3.46,null,null,null,null,null,25,0,"C6H6CIN "]
[null,143,"4-Cloroanilina",0,4.1500000000000004,null,null,null,null,null,25,0,"C6H6CIN "]
[null,144,"2-Clorofenol",-1,8.49,null,null,null,null,null,25,0,"C6H5CIO "]
[null,145,"3-Clorofenol",-1,8.85,null,null,null,null,null,25,0,"C6H5CIO "]
[null,146,"4-Clorofenol",-1,9.18,null,null,null,null,null,25,0,"C6H5CIO "]
[null,147,"Codeina ",0,8.2100000000000009,null,null,null,null,null,25,0,"C18H21NO3 "]
[null,148,"Colina",0,13.9,null,null,null,null,null,25,0,"C5H14NO "]
[null,149,"Creatinina",0,4.83,9.1999999999999993,null,null,null,null,25,0,"C4H7N3O "]
[null,150,"m-Cresol",-1,10.01,null,null,null,null,null,25,0,"C7H8O "]
[null,151,"o-Cresol",-1,10.199999999999999,null,null,null,null,null,25,0,"C7H8O "]
[null,152,"p-Cresol",-1,10.17,null,null,null,null,null,25,0,"C7H8O "]
[null,153,"Cupferron",-1,4.37,null,null,null,null,null,25,0,"C6H6N2O"]
[null,154,"Decilamina ",0,10.64,null,null,null,null,null,25,0,"C10H23N "]
[null,155,"2,3-Diclorofenol ",-1,7.46,null,null,null,null,null,25,0,"C6H4Cl2O "]
[null,156,"Dietilamina",0,10.933,null,null,null,null,null,25,0,"(CH3CH2)2NH"]
[null,157,"Difenilamina ",0,0.79,null,null,null,null,null,25,0,"C12H11N "]
[null,158,"Dimetilamina",0,10.773999999999999,null,null,null,null,null,25,0,"(CH3)2NH"]
[null,159,"Dimetilglioxima",-2,10.66,12,null,null,null,null,25,0,"C4H12O2N2"]
[null,160,"2,3-Dimetilpiridina",0,6.58,null,null,null,null,null,25,0,"C7H9N "]
[null,161,"2,4-Dimetilpiridina",0,6.99,null,null,null,null,null,25,0,"C7H9N "]
[null,162,"2,5-Dimetilpiridina",0,6.4,null,null,null,null,null,25,0,"C7H9N "]
[null,163,"3,4-Dimetilpiridina",0,6.65,null,null,null,null,null,25,0,"C7H9N "]
[null,164,"3,5-Dimetilpiridina",0,6.46,null,null,null,null,null,25,0,"C7H9N "]
[null,165,"3,6-Dimetilpiridina",0,6.15,null,null,null,null,null,25,0,"C7H9N "]
[null,166,"Disopropilamina",0,11.05,null,null,null,null,null,25,0,"C6H15N "]
[null,167,"Dopamina ",-1,8.9,10.6,null,null,null,null,25,0,"C8H11NO2 ",153.18]
[null,168,"d-Efedrina",0,10.138999999999999,null,null,null,null,null,10,0,"C10H15NO ",165.23]
[null,169,"l-Efedrina",0,9.9580000000000002,null,null,null,null,null,10,0,"C10H15NO ",165.23]
[null,170,"Etanolamina ",0,9.5,null,null,null,null,null,25,0,"C2H7NO "]
[null,171,"Etilamina",0,10.635999999999999,null,null,null,null,null,25,0,"CH3CH2NH2"]
[null,172,"Etilenodiamina",0,6.8479999999999999,9.9280000000000008,null,null,null,null,25,0,"H2NCH2CH2NH2"]
[null,173,"Etilenoimina ",0,8.01,null,null,null,null,null,25,0,"C2H5N "]
[null,174,"2-Etilpiridina ",0,5.89,null,null,null,null,null,25,0,"C7H9N "]
[null,175,"1,10-Fenantrolina ",0,4.84,null,null,null,null,null,25,0,"C12H8N2 ",180.3]
[null,176,"Fenilalanina ",-1,2.2000000000000002,9.31,null,null,null,null,25,0,"C9H11NO2 "]
[null,177,"Feniletilamina ",0,9.84,null,null,null,null,null,25,0,"C8H11N "]
[null,178,"Fenilglicina ",-1,1.83,4.3899999999999997,null,null,null,null,25,0,"C8H9NO2 "]
[null,179,"Fenol",-1,9.98,null,null,null,null,null,25,0,"HC6H5O "]
[null,180,"m-Fenotidina",0,4.18,null,null,null,null,null,25,0,"C8H11NO "]
[null,181,"o-Fenotidina",0,4.43,null,null,null,null,null,28,0,"C8H11NO "]
[null,182,"p-Fenotidina",0,5.2,null,null,null,null,null,28,0,"C8H11NO "]
[null,183,"Glicerol ",-1,14.15,null,null,null,null,null,25,0,"C3H8O3 "]
[null,184,"Glicina",-1,2.35,9.7780000000000005,null,null,null,null,25,0,"H2NCH2COOH",75.069999999999993]
[null,185,"l-Glutamina",-1,2.17,9.1300000000000008,null,null,null,null,25,0,"C5H10N2O3 ",146.15]
[null,186,"l-Glutationa",-2,2.12,3.59,8.75,9.65,null,null,25,0,"C10H17N3O6S "]
[null,187,"Heptilamina ",0,10.67,null,null,null,null,null,25,0,"C7H17N "]
[null,188,"Hexametilenodiamina ",0,10.762,11.856999999999999,null,null,null,null,0,0,"C6H16N2 "]
[null,189,"Hexilamina ",0,10.56,null,null,null,null,null,25,0,"C6H15N "]
[null,190,"Hidrazina",0,8.07,null,null,null,null,null,30,null,"N2H4"]
[null,191,"Hidrogeno cromato, íon ",-1,6.52,null,null,null,null,null,null,null,"HCrO4- "]
[null,192,"Hidrogeno selenato, íon ",-1,1.66,null,null,null,null,null,null,null,"HSeO4- "]
[null,193,"Hidroquinona ",0,10.35,null,null,null,null,null,20,null,"C6H6O2 "]
[null,194,"Hidroxilamina",0,5.96,null,null,null,null,null,25,0,"NH2OH"]
[null,195,"8-Hidroxiquinolina",-1,4.91,9.81,null,null,null,null,25,0]
[null,196,"Histamina ",0,6.04,9.75,null,null,null,null,25,0,"C5H9N3 "]
[null,197,"Histidina",-1,1.49,6.02,9.2899999999999991,null,null,null,25,0,"C6H9N3O2 "]
[null,198,"Imidazol ",0,6.9530000000000003,null,null,null,null,null,25,0,"C3H4N2 ",68.08]
[null,199,"Isoleucina",-1,2.319,9.7539999999999996,null,null,null,null,25,0,"C6H13NO2 ",131.18]
[null,200,"l-Leucina",-1,2.3279999999999998,9.7439999999999998,null,null,null,null,25,0,"C6H13NO2 "]
[null,201,"Lisina ",-1,1.83,9.08,10.9,null,null,null,25,0,"C6H14N2O2 "]
[null,202,"Melamina = 1,3,5-triazina-2,4,6-triamina",0,5,null,null,null,null,null,25,0,"C3H6N6 "]
[null,203,"Metil-1-naftilamina ",0,3.67,null,null,null,null,null,27,0,"C11H11N "]
[null,204,"Metilamina ",0,10.63,null,null,null,null,null,25,0,"CH5N ",31.1]
[null,205,"2-Metilanilina = o-touidina = amino-1-metilbenzeno",0,4.4470000000000001,null,null,null,null,null,25,0,"C7H9N","107.17"]
[null,206,"4-Metilanilina = p-toluidina = 4-amino-1-metilbenzeno",0,5.0839999999999996,null,null,null,null,null,25,0,"C7H9N","107.17"]
[null,207,"2-Metilbenzimidazol ",0,6.19,null,null,null,null,null,25,0,"C8H8N2 "]
[null,208,"2-Metilfenol = o-cresol",-1,10.28,null,null,null,null,null,25,0,"C7H8O ","108.14"]
[null,209,"4-Metilfenol = p-cresol",-1,10.26,null,null,null,null,null,25,0,"C7H8O ","108.14"]
[null,210,"1-Metilpiperidina ",0,10.08,null,null,null,null,null,25,0,"C6H13N "]
[null,211,"2-Metilpiridina",0,5.97,null,null,null,null,null,20,0,"C6H7N "]
[null,212,"3-Metilpiridina",0,5.68,null,null,null,null,null,20,0,"C6H7N "]
[null,213,"4-Metilpiridina",0,6.02,null,null,null,null,null,20,0,"C6H7N "]
[null,214,"Metionina = Ácido (S)-2-amino-4-(metilssulfanilo)-butanóico ",-1,2.13,9.27,null,null,null,null,25,0,"C5H11NO2S "]
[null,215,"Morfina ",0,8.2100000000000009,null,null,null,null,null,25,0,"C17H19NO3 "]
[null,216,"Morfolina ",0,8.33,null,null,null,null,null,25,0,"C4H9NO "]
[null,217,"1-Naftol",-1,9.34,null,null,null,null,null,25,0,"C10H8O "]
[null,218,"2-Naftol",-1,9.51,null,null,null,null,null,25,0,"C10H8O "]
[null,219,"Nicotina ",0,3.12,8.02,null,null,null,null,25,0,"C10H14N2 "]
[null,220,"2-Nitroanilina ",0,-0.26,null,null,null,null,null,25,0,"C6H6N2O2 "]
[null,221,"3-Nitroanilina",0,2.4660000000000002,null,null,null,null,null,25,0,"C6H6N2O2 "]
[null,222,"4-Nitroanilina",0,1,null,null,null,null,null,25,0,"C6H6N2O2 "]
[null,223,"2-Nitrofenol",-1,7.21,null,null,null,null,null,25,0,"C6H5NO3 "]
[null,224,"3-Nitrofenol",-1,8.39,null,null,null,null,null,25,0,"C6H5NO3 "]
[null,225,"4-Nitrofenol",-1,7.15,null,null,null,null,null,25,0,"C6H5NO3 "]
[null,226,"Noradrenalina ",-1,8.64,9.6999999999999993,null,null,null,null,25,0,"C8H11NO3 "]
[null,227,"Octadecilamina ",0,10.6,null,null,null,null,null,25,0,"C18H39N "]
[null,228,"Papaverina ",0,6.4,null,null,null,null,null,25,0,"C20H21NO4 "]
[null,229,"Paracetamol = acetaminofeno",0,9.51,null,null,null,null,null,25,0,"C8H9NO2 ",151.16999999999999]
[null,230,"Peróxido de hidrogênio",-1,11.65,null,null,null,null,null,25,0,"H2O2"]
[null,231,"Pilocarpina ",0,6.87,null,null,null,null,null,30,0,"C11H16N2O2 ",208.25899999999999]
[null,232,"Piperazina ",0,5.3330000000000002,9.7309999999999999,null,null,null,null,23,0,"C4H10N2 "]
[null,233,"Piperidina",0,7.53,11.122999999999999,null,null,null,null,25,0,"C5H11N",85.15]
[null,234,"Piridina",0,5.2290000000000001,null,null,null,null,null,25,0,"C5H5N",79.099999999999994]
[null,235,"Pirimidina ",0,1.1000000000000001,null,null,null,null,null,20,0,"C4H4N2O3 ",80.087999999999994]
[null,236,"Pirocatecol ",-2,9.4,12.8,null,null,null,null,20,0,"C6H6O2 ",110.1]
[null,237,"Pirrolidina ",0,11.27,null,null,null,null,null,25,0,"C4H9N "]
[null,238,"Prolina",-1,1.952,10.64,null,null,null,null,25,0,"C5H9NO2",115.13]
[null,239,"Propilamina",0,10.566000000000001,null,null,null,null,null,25,0,"CH3CH2CH2NH2"]
[null,240,"Purina ",0,2.2999999999999998,8.9600000000000009,null,null,null,null,20,0,"C5H4N4 ",120.11]
[null,241,"Quinina ",0,4.13,8.52,null,null,null,null,25,0,"C20H24N2O2 ",324.42]
[null,242,"Quinolina ",0,4.9000000000000004,null,null,null,null,null,20,0,"C9H7N ",129.16]
[null,243,"Resorcinol",-2,9.3000000000000007,11.06,null,null,null,null,25,0,"C6H6O2 ",110.1]
[null,244,"Sacarina ",-1,11.68,null,null,null,null,null,18,0,"C7H5NO3S "]
[null,245,"Serina ",-1,2.19,9.0500000000000007,null,null,null,null,25,0,"C3H7NO3",105.09]
[null,246,"Stricnina",0,8.26,null,null,null,null,null,25,0,"C21H22N2O2 ",334.41]
[null,247,"Tiazol ",0,2.44,null,null,null,null,null,20,0,"C3H3NS "]
[null,248,"Tiramina ",0,9.74,10.52,null,null,null,null,25,0,"C8H11NO "]
[null,249,"Tirosina ",-1,2.17,9.19,10.47,null,null,null,25,0,"C9H11NO3 "]
[null,250,"Treonina",-1,2.0880000000000001,9.1,null,null,null,null,25,0,"C4H9NO3",119.12]
[null,251,"Trietanolamina",0,7.7619999999999996,null,null,null,null,null,25,0,"(HOCH2CH2)3NH"]
[null,252,"Trietilamina",0,10.715,null,null,null,null,null,25,0,"(CH3CH2)3NH"]
[null,253,"Trimetilamina",0,9.8000000000000007,null,null,null,null,null,25,0,"(CH3)3NH"]
[null,254,"Triptofano",-1,2.35,9.5399999999999991,null,null,null,null,25,0,"C11H12N2O2 "]
[null,255,"Tris(hidroximetil)-aminometano = tris",0,8.0749999999999993,null,null,null,null,null,25,0,"(HOCH2)3CNH3"]
[null,256,"Uréia ",0,0.1,null,null,null,null,null,21,0,"CH4N2O "]
[null,257,"Valina ",-1,2.286,9.718,null,null,null,null,25,0,"C5H11NO2 "]
[null,258,"I N D I C A D O R E S",null,null,null,null,null,null,null,null,null,null,null,"pKa","pH < pKa","pH = pKa","pH>pka",null,null,null,"Tons de cores"]
[null,259,"Azul de Timol (pKa 1,7)",-2,1.7,8.9,null,null,null,null,null,null,"C27H30O5S",466.59,1.7,5263615,4107000,4907000,null,null,null,"green/verde",1701178,8374896,52377,7722000,1702000]
[null,260,"Alaranjado de Metila (pKa 3,5)",-2,-1,3.47,null,null,null,null,null,null,"C14H14N3NaO3S",327.33,3.47,5263615,4961023,4907000,null,null,null,"blue/azul",16763955,16750899,15456000]
[null,261,"Verde de Bromocresol (pKa 4,8)",-2,-1,4.8,null,null,null,null,null,null,"C21H14Br4O5S",698.01,4.8,4907000,52377,16750899,null,null,null,"red/vermelho",7039480,5263615,14666000]
[null,262,"Vermelho de Metila (pKa 5,1)",-1,5.0999999999999996,null,null,null,null,null,null,null,"C15H15N3O2",269.3,5.0999999999999996,5263615,4961023,4907000,null,null,null,"yellow/amarelo",4907000,10285055,3339000,60395]
[null,263,"Azul de Bromotimol (pKa 7,1)",-1,7.1,null,null,null,null,null,null,null,"C27H28Br2O5S",624.38,7.1,4907000,6813000,16750899,null,null,null,"white/branco",16777215]
[null,264,"Vermelho de fenol (pKa 7,7)",-2,1.2,7.7,null,null,null,null,null,null,"C19H14O5S",354.38,7.7,4907000,4961023,5263615,null,null,null,"orange/alaranjado",4961023]
[null,265,"Azul de Timol (pKa 8,9)",-2,1.7,8.9,null,null,null,null,null,null,"C27H30O5S",466.59,8.9,4907000,52377,16750899]
[null,266,"Fenolftaleína (pKa 9,7)",-2,9.5,9.6999999999999993,null,null,null,null,null,null,"C20H14O4",318.32,9.6999999999999993,15395562,16564985,16419572]
[null,267,"Alizarina amarela R (pKa 11)",-1,11,null,null,null,null,null,null,null,"C13H9N3O5 ",287.23,11,4907000,4961023,5263615]
[null,268]
[null,269]
[null,270]
[null,271]
[null,272]
[null,273]
[null,274]
[null,275]
[null,276]
[null,277]
[null,278]
[null,279]
[null,280]